program: Orca
programVersion: 5.0.2
elementType: O O O C C C C C C C C C C C C C C C C C C C C C C C H H H H H H H H H H H H H H H H H H H H H H H H H H
charge: 0
multiplicity: 1
keywords: wb97x-d3
keywords: def2-TZVPP
keywords: def2/J RIJCOSX
keywords: DEFGRID2
keywords: scfconv7
keywords: smallprint printgap noloewdin
keywords: NOSOSCF
formula: C23H26O3
InChI: InChI=1/C23H26O3/c1-16(2)13-20-21(23(20,3)4)22(24)25-15-17-9-8-12-19(14-17)26-18-10-6-5-7-11-18/h5-14,20-21H,15H2,1-4H3
52 atoms
O  0.212125 -1.571686 0.248308
O  -1.081651 -2.312745 1.909156
O  4.232622 2.182159 -0.155444
C  -3.040344 -2.941739 -0.479655
C  -3.470186 -1.682539 0.208324
C  -2.034174 -1.826889 -0.237196
C  -3.443759 -3.153034 -1.918341
C  -2.988634 -4.221799 0.316096
C  -4.338694 -0.676592 -0.452867
C  -0.956965 -1.943989 0.764236
C  -5.65757 -0.569954 -0.270216
C  -6.458149 0.487953 -0.966465
C  -6.444934 -1.476364 0.624945
C  1.363115 -1.604739 1.105667
C  2.495884 -1.016555 0.32121
C  2.805986 0.33126 0.462228
C  3.218068 -1.804923 -0.568792
C  3.832445 0.884889 -0.292959
C  4.244392 -1.243448 -1.312773
C  4.552339 0.102443 -1.185234
C  3.335206 3.186032 0.080763
C  2.093865 3.245055 -0.541759
C  3.749873 4.203174 0.929597
C  1.267543 4.333591 -0.298726
C  2.918113 5.290454 1.152897
C  1.671968 5.35903 0.545294
H  -3.615936 -1.793507 1.279244
H  -1.75432 -1.274125 -1.127891
H  -3.407542 -2.235924 -2.506067
H  -4.463538 -3.540541 -1.975884
H  -2.78693 -3.880479 -2.399944
H  -2.821845 -4.061691 1.379163
H  -2.204713 -4.887449 -0.052143
H  -3.939105 -4.750133 0.212683
H  -3.855028 0.016631 -1.135404
H  -6.976435 1.126907 -0.246209
H  -7.233586 0.042943 -1.59581
H  -5.839361 1.126918 -1.596694
H  -6.917656 -0.912083 1.433408
H  -5.845956 -2.266693 1.07495
H  -7.256425 -1.953515 0.069021
H  1.57834 -2.635646 1.395473
H  1.174269 -1.027732 2.013002
H  2.25119 0.936001 1.17011
H  2.981445 -2.856531 -0.675442
H  4.809942 -1.854942 -2.00375
H  5.353167 0.543747 -1.765277
H  1.770194 2.461567 -1.215567
H  4.721471 4.145166 1.40422
H  0.301094 4.380373 -0.784155
H  3.247005 6.083634 1.811994
H  1.022392 6.205585 0.724648
elementType: O C H
totalener: -1117.87007752 hartree
nucrepener: 2155.88477572 hartree
electener: -3273.75485324 hartree
oneelecener: -5801.01043811 hartree
twoeener: 2527.25558487 hartree
cpcmener: -0.02506384 hartree
kineticenergy: 1112.80219302 hartree
xcener: -110.222684140646 hartree
chargesum: -0.0000000
charge: -0.276213 -0.477081 -0.326712 0.143033 -0.010922 -0.122943 -0.265753 -0.298050 -0.252303 0.405525 -0.037148 -0.229444 -0.249655 0.082466 -0.031157 -0.174855 -0.209406 0.270370 -0.123722 -0.237941 0.298525 -0.204031 -0.257623 -0.139339 -0.116506 -0.191924 0.098082 0.088281 0.090738 0.095046 0.098647 0.094166 0.101014 0.094757 0.120569 0.094385 0.093936 0.088251 0.099877 0.087238 0.094779 0.117256 0.107322 0.143838 0.144124 0.157010 0.146589 0.156480 0.145403 0.159371 0.157828 0.157822
qa: -0.2762 -0.4771 -0.3267 0.1430 -0.0109 -0.1229 -0.2658 -0.2981 -0.2523 0.4055 -0.0371 -0.2294 -0.2497 0.0825 -0.0312 -0.1749 -0.2094 0.2704 -0.1237 -0.2379 0.2985 -0.2040 -0.2576 -0.1393 -0.1165 -0.1919 0.0981 0.0883 0.0907 0.0950 0.0986 0.0942 0.1010 0.0948 0.1206 0.0944 0.0939 0.0883 0.0999 0.0872 0.0948 0.1173 0.1073 0.1438 0.1441 0.1570 0.1466 0.1565 0.1454 0.1594 0.1578 0.1578
va: 2.1268 2.0287 2.0789 3.6636 3.7831 3.9178 3.9069 3.9004 3.8649 4.1621 3.7055 3.9283 3.9401 3.8049 3.7761 3.9071 3.9469 3.7348 3.9007 4.0063 3.6837 3.9167 4.0112 3.8886 3.8814 3.9108 1.0255 1.0371 1.0027 1.0025 1.0030 1.0187 0.9993 1.0009 1.0073 0.9952 0.9962 1.0080 0.9982 1.0083 0.9979 0.9967 1.0031 1.0063 1.0023 0.9896 1.0068 0.9978 1.0090 0.9902 0.9890 0.9908
dispcorr: -0.022488426 hartree
energy: -1117.892565946828
dipole: -37.08827 36.49473 -0.59355 -12.01991 12.12893 0.10902 -4.95424 4.04776 -0.90648
magnitude: 1.08898 au
magnitude: 2.76798 debye
