program: Orca
programVersion: 5.0.2
elementType: O O O C C C C C C C C C C C C C C C C C C C C C C C H H H H H H H H H H H H H H H H H H H H H H H H H H
charge: 0
multiplicity: 1
keywords: wb97x-d3
keywords: def2-TZVPP
keywords: def2/J RIJCOSX
keywords: DEFGRID2
keywords: scfconv7
keywords: smallprint printgap noloewdin
keywords: NOSOSCF
formula: C23H26O3
InChI: InChI=1/C23H26O3/c1-16(2)13-20-21(23(20,3)4)22(24)25-15-17-9-8-12-19(14-17)26-18-10-6-5-7-11-18/h5-14,20-21H,15H2,1-4H3
52 atoms
O  0.434047 -2.724306 0.066313
O  -0.242868 -1.208227 1.566117
O  2.954176 2.184704 0.17219
C  -3.10605 -2.073668 0.625829
C  -2.698854 -0.81592 -0.061402
C  -1.766253 -2.015218 -0.091597
C  -4.138912 -2.956941 -0.031976
C  -3.16876 -2.108394 2.132921
C  -3.358694 -0.338655 -1.304864
C  -0.4793 -1.922913 0.619919
C  -2.740324 0.208494 -2.354821
C  -3.510517 0.686249 -3.548508
C  -1.257193 0.396357 -2.441959
C  1.804518 -2.580013 0.473546
C  2.415753 -1.415831 -0.252646
C  2.467072 -0.163566 0.346973
C  2.852259 -1.566516 -1.566885
C  2.905996 0.934499 -0.381156
C  3.325572 -0.470502 -2.27149
C  3.340416 0.789813 -1.690134
C  1.909621 2.607013 0.951525
C  0.586512 2.334193 0.621922
C  2.217089 3.364911 2.072378
C  -0.428198 2.816662 1.434824
C  1.190132 3.851187 2.869787
C  -0.134177 3.573538 2.561412
H  -2.362997 -0.028959 0.611107
H  -1.721348 -2.563393 -1.025869
H  -4.032323 -3.989893 0.305369
H  -4.060065 -2.956318 -1.119664
H  -5.148103 -2.629217 0.227484
H  -2.92309 -3.101963 2.514118
H  -4.18267 -1.873574 2.463662
H  -2.500307 -1.392863 2.60593
H  -4.44262 -0.417065 -1.332501
H  -4.583498 0.527986 -3.439678
H  -3.184348 0.171589 -4.456437
H  -3.343148 1.752481 -3.722766
H  -1.012666 1.452445 -2.586234
H  -0.849294 -0.131845 -3.308551
H  -0.723411 0.049885 -1.558874
H  2.280908 -3.516289 0.186183
H  1.885848 -2.476873 1.556104
H  2.149067 -0.043293 1.374748
H  2.822628 -2.541358 -2.038571
H  3.671153 -0.590683 -3.290257
H  3.68759 1.65245 -2.24502
H  0.342271 1.755185 -0.25985
H  3.2515 3.57207 2.317007
H  -1.457621 2.601208 1.177658
H  1.431623 4.442321 3.743812
H  -0.931313 3.945779 3.191293
elementType: O C H
totalener: -1117.86726129 hartree
nucrepener: 2346.22163102 hartree
electener: -3464.08889230 hartree
oneelecener: -6182.31775621 hartree
twoeener: 2718.22886391 hartree
cpcmener: -0.02378206 hartree
kineticenergy: 1112.79850607 hartree
xcener: -110.224775394624 hartree
chargesum: -0.0000000
charge: -0.284502 -0.470759 -0.333458 0.146922 -0.021829 -0.069589 -0.287021 -0.283719 -0.290100 0.359474 -0.013683 -0.229994 -0.214651 0.082722 -0.013860 -0.152397 -0.226610 0.248801 -0.118383 -0.241368 0.264451 -0.168846 -0.221141 -0.180625 -0.137694 -0.166467 0.096960 0.096326 0.097843 0.092858 0.098116 0.098931 0.093391 0.093231 0.121152 0.089216 0.094901 0.095799 0.103013 0.103861 0.047228 0.123097 0.114066 0.143071 0.142187 0.157844 0.146695 0.157732 0.144280 0.157902 0.156969 0.157655
qa: -0.2845 -0.4708 -0.3335 0.1469 -0.0218 -0.0696 -0.2870 -0.2837 -0.2901 0.3595 -0.0137 -0.2300 -0.2147 0.0827 -0.0139 -0.1524 -0.2266 0.2488 -0.1184 -0.2414 0.2645 -0.1688 -0.2211 -0.1806 -0.1377 -0.1665 0.0970 0.0963 0.0978 0.0929 0.0981 0.0989 0.0934 0.0932 0.1212 0.0892 0.0949 0.0958 0.1030 0.1039 0.0472 0.1231 0.1141 0.1431 0.1422 0.1578 0.1467 0.1577 0.1443 0.1579 0.1570 0.1577
va: 2.1146 2.0189 2.0783 3.7092 3.8174 3.7759 3.9090 3.8899 3.8622 4.1707 3.7376 3.9307 3.9349 3.8107 3.6385 3.8647 3.9701 3.7470 3.8846 4.0112 3.7271 3.8390 3.9836 3.9257 3.9011 3.8986 1.0203 1.0291 1.0030 1.0020 1.0003 0.9987 1.0010 1.0198 1.0051 1.0064 0.9967 0.9964 0.9988 1.0016 1.0098 0.9943 1.0135 1.0224 1.0034 0.9884 1.0057 0.9928 1.0081 0.9901 0.9892 0.9901
dispcorr: -0.028149395 hartree
energy: -1117.895410681332
dipole: -24.48789 23.94685 -0.54104 -6.19531 5.50937 -0.68594 -7.94756 7.02821 -0.91936
magnitude: 1.26825 au
magnitude: 3.22363 debye
