program: Orca
programVersion: 5.0.2
elementType: O O O C C C C C C C C C C C C C C C C C C C C C C C H H H H H H H H H H H H H H H H H H H H H H H H H H
charge: 0
multiplicity: 1
keywords: wb97x-d3
keywords: def2-TZVPP
keywords: def2/J RIJCOSX
keywords: DEFGRID2
keywords: scfconv7
keywords: smallprint printgap noloewdin
keywords: NOSOSCF
formula: C23H26O3
InChI: InChI=1/C23H26O3/c1-16(2)13-20-21(23(20,3)4)22(24)25-15-17-9-8-12-19(14-17)26-18-10-6-5-7-11-18/h5-14,20-21H,15H2,1-4H3
52 atoms
O  0.507063 -2.235579 -1.354157
O  -0.018421 -3.119136 0.631294
O  1.981124 2.061359 0.932762
C  -2.994398 -2.692368 -0.339656
C  -2.557918 -1.527935 0.480321
C  -1.687552 -2.004311 -0.683867
C  -4.088655 -2.509624 -1.365011
C  -3.001808 -4.060909 0.296823
C  -3.179418 -0.187437 0.4343
C  -0.351349 -2.531754 -0.370337
C  -2.729414 0.858452 1.134657
C  -3.419072 2.186426 1.090458
C  -1.525648 0.776673 2.030934
C  1.892154 -2.439003 -1.108622
C  2.460883 -1.412512 -0.164565
C  1.916564 -0.13346 -0.088395
C  3.574243 -1.736915 0.60171
C  2.498346 0.811239 0.747519
C  4.148578 -0.782557 1.428236
C  3.619872 0.495457 1.503329
C  1.375329 2.763903 -0.069731
C  0.360208 3.631164 0.316108
C  1.779725 2.700287 -1.39799
C  -0.257288 4.431405 -0.632877
C  1.144039 3.499331 -2.338522
C  0.126233 4.366128 -1.965534
H  -2.14586 -1.803953 1.446604
H  -1.719847 -1.389792 -1.576174
H  -4.023207 -1.555828 -1.888189
H  -5.073497 -2.567537 -0.897232
H  -4.035169 -3.296973 -2.119421
H  -3.994029 -4.268155 0.702842
H  -2.290667 -4.156267 1.114336
H  -2.77921 -4.838722 -0.436354
H  -4.052871 -0.056705 -0.197115
H  -2.754793 2.959078 0.693511
H  -3.704949 2.512646 2.094431
H  -4.318549 2.166147 0.474902
H  -0.760587 0.096503 1.654354
H  -1.801779 0.4307 3.03149
H  -1.06303 1.755663 2.159511
H  2.363182 -2.345524 -2.088262
H  2.089842 -3.450016 -0.746646
H  1.042967 0.124844 -0.674065
H  3.989856 -2.736144 0.555836
H  5.015614 -1.036078 2.024236
H  4.061553 1.242697 2.150441
H  0.066114 3.683412 1.356928
H  2.583162 2.043432 -1.705827
H  -1.044106 5.108281 -0.325127
H  1.458714 3.446145 -3.37285
H  -0.359691 4.988826 -2.705143
elementType: O C H
totalener: -1117.86741994 hartree
nucrepener: 2335.09237787 hartree
electener: -3452.95979781 hartree
oneelecener: -6159.83310514 hartree
twoeener: 2706.87330732 hartree
cpcmener: -0.02547686 hartree
kineticenergy: 1112.79931737 hartree
xcener: -110.228861250439 hartree
chargesum: -0.0000000
charge: -0.297242 -0.465859 -0.326330 0.151150 -0.037368 -0.062629 -0.292020 -0.272343 -0.261993 0.359584 -0.012158 -0.216453 -0.287354 0.102153 0.050329 -0.291458 -0.244532 0.346658 -0.098122 -0.281016 0.340724 -0.301602 -0.228608 -0.109039 -0.139352 -0.189615 0.102311 0.090425 0.086806 0.103223 0.099190 0.094409 0.092105 0.097991 0.121025 0.082350 0.100024 0.088060 0.082518 0.119743 0.091217 0.119764 0.113190 0.146992 0.140023 0.156867 0.143882 0.160717 0.157096 0.158228 0.158765 0.157575
qa: -0.2972 -0.4659 -0.3263 0.1512 -0.0374 -0.0626 -0.2920 -0.2723 -0.2620 0.3596 -0.0122 -0.2165 -0.2874 0.1022 0.0503 -0.2915 -0.2445 0.3467 -0.0981 -0.2810 0.3407 -0.3016 -0.2286 -0.1090 -0.1394 -0.1896 0.1023 0.0904 0.0868 0.1032 0.0992 0.0944 0.0921 0.0980 0.1210 0.0823 0.1000 0.0881 0.0825 0.1197 0.0912 0.1198 0.1132 0.1470 0.1400 0.1569 0.1439 0.1607 0.1571 0.1582 0.1588 0.1576
va: 2.1038 2.0363 2.0706 3.7709 3.8196 3.7903 3.9160 3.8801 3.8748 4.1804 3.7013 3.9207 3.9498 3.8028 3.6370 3.9206 3.9983 3.6317 3.8780 4.0397 3.6559 3.9678 3.9259 3.8571 3.8927 3.9209 1.0226 1.0348 1.0027 0.9989 1.0021 1.0005 1.0192 0.9998 1.0074 0.9991 0.9946 1.0095 1.0029 0.9988 1.0069 0.9909 1.0123 1.0143 1.0027 0.9887 1.0088 0.9979 0.9968 0.9896 0.9899 0.9905
dispcorr: -0.027540449 hartree
energy: -1117.894960392908
dipole: -22.14718 21.90024 -0.24694 -2.69936 3.18657 0.48721 0.78577 -1.85552 -1.06975
magnitude: 1.20113 au
magnitude: 3.05304 debye
