program: Orca
programVersion: 5.0.2
elementType: O O O C C C C C C C C C C C C C C C C C C C C C C C H H H H H H H H H H H H H H H H H H H H H H H H H H
charge: 0
multiplicity: 1
keywords: wb97x-d3
keywords: def2-TZVPP
keywords: def2/J RIJCOSX
keywords: DEFGRID2
keywords: scfconv7
keywords: smallprint printgap noloewdin
keywords: NOSOSCF
formula: C23H26O3
InChI: InChI=1/C23H26O3/c1-16(2)13-20-21(23(20,3)4)22(24)25-15-17-9-8-12-19(14-17)26-18-10-6-5-7-11-18/h5-14,20-21H,15H2,1-4H3
52 atoms
O  0.506898 -2.080265 -1.515314
O  0.051992 -3.124205 0.407081
O  1.927583 2.05809 1.043182
C  -2.952717 -2.72536 -0.48212
C  -2.539921 -1.646322 0.457104
C  -1.677372 -1.952954 -0.767847
C  -4.078246 -2.471637 -1.456855
C  -2.89489 -4.157452 -0.009796
C  -3.213198 -0.334208 0.574414
C  -0.319516 -2.468664 -0.537696
C  -2.783817 0.659398 1.359038
C  -3.529595 1.953827 1.460028
C  -1.548339 0.564566 2.204498
C  1.902136 -2.275387 -1.314774
C  2.469441 -1.313611 -0.304928
C  1.897421 -0.059434 -0.117367
C  3.607681 -1.665431 0.412757
C  2.474294 0.833918 0.776885
C  4.170665 -0.765537 1.305182
C  3.613252 0.49042 1.490636
C  1.358131 2.812194 0.055929
C  1.852287 2.850404 -1.242878
C  0.281042 3.608369 0.423322
C  1.241292 3.675699 -2.176593
C  -0.31155 4.437355 -0.51825
C  0.158714 4.470209 -1.823763
H  -2.09952 -2.015524 1.378156
H  -1.753371 -1.244008 -1.584488
H  -4.013018 -3.162357 -2.29967
H  -4.068424 -1.460829 -1.86475
H  -5.046748 -2.627659 -0.976524
H  -2.150644 -4.324501 0.766305
H  -2.677088 -4.835216 -0.838151
H  -3.865059 -4.44509 0.402676
H  -4.114534 -0.177798 -0.010294
H  -2.914044 2.787008 1.10855
H  -3.788614 2.180449 2.498152
H  -4.451513 1.948609 0.878156
H  -0.856375 -0.210836 1.874298
H  -1.805258 0.357026 3.24854
H  -1.00453 1.511737 2.203968
H  2.350415 -2.096376 -2.293633
H  2.125192 -3.308245 -1.039019
H  1.004832 0.225385 -0.660862
H  4.051102 -2.644775 0.279166
H  5.05451 -1.043028 1.864829
H  4.050959 1.193364 2.188127
H  2.704384 2.250363 -1.535838
H  -0.086064 3.584037 1.441707
H  1.624818 3.697935 -3.188628
H  -1.14984 5.056487 -0.225307
H  -0.310835 5.111542 -2.557979
elementType: O C H
totalener: -1117.86818825 hartree
nucrepener: 2329.34331795 hartree
electener: -3447.21150620 hartree
oneelecener: -6148.35703420 hartree
twoeener: 2701.14552800 hartree
cpcmener: -0.02547949 hartree
kineticenergy: 1112.78946063 hartree
xcener: -110.226581613618 hartree
chargesum: -0.0000000
charge: -0.297376 -0.467340 -0.330777 0.154576 -0.036437 -0.059460 -0.292766 -0.271164 -0.263852 0.356509 -0.011418 -0.220891 -0.269438 0.102114 0.046963 -0.263628 -0.242370 0.321124 -0.100770 -0.273985 0.312698 -0.207850 -0.283866 -0.143582 -0.111955 -0.190232 0.101064 0.091794 0.098930 0.087102 0.102890 0.092259 0.097406 0.094256 0.121301 0.083224 0.096985 0.088797 0.079276 0.115138 0.082707 0.120746 0.113185 0.144849 0.140508 0.156876 0.144865 0.154505 0.162588 0.158667 0.157650 0.157605
qa: -0.2974 -0.4673 -0.3308 0.1546 -0.0364 -0.0595 -0.2928 -0.2712 -0.2639 0.3565 -0.0114 -0.2209 -0.2694 0.1021 0.0470 -0.2636 -0.2424 0.3211 -0.1008 -0.2740 0.3127 -0.2079 -0.2839 -0.1436 -0.1120 -0.1902 0.1011 0.0918 0.0989 0.0871 0.1029 0.0923 0.0974 0.0943 0.1213 0.0832 0.0970 0.0888 0.0793 0.1151 0.0827 0.1207 0.1132 0.1448 0.1405 0.1569 0.1449 0.1545 0.1626 0.1587 0.1576 0.1576
va: 2.1062 2.0320 2.0645 3.7670 3.8147 3.7847 3.9163 3.8803 3.8857 4.1814 3.7044 3.9294 3.9467 3.8014 3.6344 3.9147 3.9940 3.6517 3.8798 4.0420 3.6923 3.9152 3.9683 3.8935 3.8734 3.9197 1.0229 1.0333 1.0021 1.0024 0.9990 1.0189 1.0000 1.0006 1.0072 0.9979 0.9950 1.0086 1.0108 0.9991 1.0074 0.9908 1.0126 1.0161 1.0025 0.9887 1.0078 0.9974 0.9939 0.9901 0.9905 0.9906
dispcorr: -0.027112932 hartree
energy: -1117.895301182313
dipole: -22.17373 21.92401 -0.24972 -3.52683 4.05820 0.53137 1.18459 -2.23499 -1.05040
magnitude: 1.20335 au
magnitude: 3.05867 debye
