program: Orca
programVersion: 5.0.2
elementType: O O O C C C C C C C C C C C C C C C C C C C C C C C H H H H H H H H H H H H H H H H H H H H H H H H H H
charge: 0
multiplicity: 1
keywords: wb97x-d3
keywords: def2-TZVPP
keywords: def2/J RIJCOSX
keywords: DEFGRID2
keywords: scfconv7
keywords: smallprint printgap noloewdin
keywords: NOSOSCF
formula: C23H26O3
InChI: InChI=1/C23H26O3/c1-16(2)13-20-21(23(20,3)4)22(24)25-15-17-9-8-12-19(14-17)26-18-10-6-5-7-11-18/h5-14,20-21H,15H2,1-4H3
52 atoms
O  0.111578 -1.560828 0.206467
O  -1.194496 -2.020403 1.95777
O  4.352171 2.181869 -0.161746
C  -3.115519 -3.121308 -0.266134
C  -3.561362 -1.740487 0.105679
C  -2.113442 -1.977857 -0.257159
C  -3.476491 -3.658184 -1.629547
C  -3.100447 -4.182347 0.804971
C  -4.408922 -0.917391 -0.791645
C  -1.057241 -1.866124 0.766781
C  -5.72495 -0.738424 -0.648604
C  -6.499583 0.124838 -1.597336
C  -6.534452 -1.361536 0.447809
C  1.257081 -1.436543 1.061442
C  2.367803 -0.883111 0.220267
C  2.816028 0.414141 0.434106
C  2.942484 -1.656595 -0.78512
C  3.829938 0.936007 -0.361805
C  3.955319 -1.128225 -1.568864
C  4.399788 0.171235 -1.368656
C  3.555444 3.230027 0.20865
C  2.288447 3.430384 -0.32665
C  4.096155 4.141468 1.105562
C  1.563097 4.550978 0.052321
C  3.363984 5.263632 1.46521
C  2.093088 5.471038 0.94693
H  -3.73701 -1.606504 1.169298
H  -1.811519 -1.638161 -1.24232
H  -3.409942 -2.902031 -2.411526
H  -4.497959 -4.044831 -1.63146
H  -2.81249 -4.479277 -1.907373
H  -2.972576 -3.778405 1.806712
H  -2.309228 -4.915058 0.631931
H  -4.050962 -4.720502 0.791137
H  -3.911907 -0.432865 -1.627492
H  -6.993828 0.944876 -1.069185
H  -7.291628 -0.445615 -2.08988
H  -5.866361 0.558575 -2.371537
H  -6.953443 -0.595543 1.10641
H  -5.967788 -2.057915 1.064069
H  -7.386204 -1.906353 0.032644
H  1.518208 -2.418679 1.463302
H  1.039505 -0.773445 1.900268
H  2.375115 1.009197 1.225137
H  2.603683 -2.672004 -0.951018
H  4.40398 -1.728502 -2.349718
H  5.189505 0.587017 -1.981819
H  1.866364 2.728749 -1.035241
H  5.086446 3.974717 1.511101
H  0.575789 4.705517 -0.363719
H  3.790861 5.9745 2.161014
H  1.521825 6.343814 1.234552
elementType: O C H
totalener: -1117.86990755 hartree
nucrepener: 2145.36538983 hartree
electener: -3263.23529738 hartree
oneelecener: -5779.98540894 hartree
twoeener: 2516.75011156 hartree
cpcmener: -0.02504578 hartree
kineticenergy: 1112.79764836 hartree
xcener: -110.222387836426 hartree
chargesum: -0.0000000
charge: -0.279585 -0.476778 -0.328503 0.146634 -0.006951 -0.125665 -0.264478 -0.298379 -0.257770 0.409171 -0.033582 -0.228758 -0.250625 0.093090 -0.022332 -0.171613 -0.230111 0.266356 -0.122741 -0.236145 0.292845 -0.198965 -0.253222 -0.142186 -0.119257 -0.189190 0.098268 0.087665 0.090243 0.094540 0.098508 0.094599 0.100444 0.094433 0.120321 0.093705 0.093747 0.088937 0.100386 0.087122 0.094069 0.120926 0.100130 0.145791 0.144368 0.157541 0.146455 0.156291 0.145421 0.159592 0.157420 0.157817
qa: -0.2796 -0.4768 -0.3285 0.1466 -0.0070 -0.1257 -0.2645 -0.2984 -0.2578 0.4092 -0.0336 -0.2288 -0.2506 0.0931 -0.0223 -0.1716 -0.2301 0.2664 -0.1227 -0.2361 0.2928 -0.1990 -0.2532 -0.1422 -0.1193 -0.1892 0.0983 0.0877 0.0902 0.0945 0.0985 0.0946 0.1004 0.0944 0.1203 0.0937 0.0937 0.0889 0.1004 0.0871 0.0941 0.1209 0.1001 0.1458 0.1444 0.1575 0.1465 0.1563 0.1454 0.1596 0.1574 0.1578
va: 2.1289 2.0294 2.0769 3.6577 3.7814 3.9237 3.9068 3.8995 3.8703 4.1558 3.7037 3.9279 3.9418 3.7948 3.7753 3.9042 3.9599 3.7437 3.8998 4.0079 3.6873 3.9117 4.0084 3.8919 3.8841 3.9087 1.0237 1.0376 1.0029 1.0032 1.0027 1.0197 0.9995 1.0007 1.0073 0.9951 0.9967 1.0079 0.9976 1.0080 0.9982 0.9945 1.0098 1.0053 1.0049 0.9894 1.0068 0.9975 1.0085 0.9902 0.9893 0.9907
dispcorr: -0.022379170 hartree
energy: -1117.892286715969
dipole: -37.42484 36.82286 -0.60198 -13.42812 13.38736 -0.04076 -4.82736 3.95420 -0.87316
magnitude: 1.06135 au
magnitude: 2.69773 debye
