program: Orca
programVersion: 5.0.2
elementType: O O O C C C C C C C C C C C C C C C C C C C C C C C H H H H H H H H H H H H H H H H H H H H H H H H H H
charge: 0
multiplicity: 1
keywords: wb97x-d3
keywords: def2-TZVPP
keywords: def2/J RIJCOSX
keywords: DEFGRID2
keywords: scfconv7
keywords: smallprint printgap noloewdin
keywords: NOSOSCF
formula: C23H26O3
InChI: InChI=1/C23H26O3/c1-16(2)13-20-21(23(20,3)4)22(24)25-15-17-9-8-12-19(14-17)26-18-10-6-5-7-11-18/h5-14,20-21H,15H2,1-4H3
52 atoms
O  0.436856 -2.809331 0.339043
O  -0.278148 -1.029475 1.487522
O  2.873479 2.290816 -0.137413
C  -3.150949 -2.072723 0.795691
C  -2.710563 -1.097382 -0.238255
C  -1.803884 -2.273769 0.127252
C  -4.191023 -3.107662 0.436698
C  -3.239903 -1.620522 2.23295
C  -3.28936 -1.002014 -1.599055
C  -0.508142 -1.957935 0.747463
C  -2.685684 -0.380928 -2.616822
C  -3.332854 -0.264233 -3.961894
C  -1.333286 0.257799 -2.491494
C  1.804537 -2.451471 0.586085
C  2.198075 -1.308385 -0.306409
C  2.411423 -0.044571 0.226332
C  2.2703 -1.497502 -1.684782
C  2.659041 1.029487 -0.619231
C  2.549379 -0.424872 -2.516599
C  2.729618 0.847713 -1.991756
C  2.099324 2.77041 0.883614
C  0.741484 2.489252 0.987339
C  2.719673 3.606889 1.801305
C  0.013467 3.045828 2.028951
C  1.975421 4.166131 2.829929
C  0.621897 3.884145 2.953379
H  -2.351584 -0.155429 0.168919
H  -1.769762 -3.080337 -0.596011
H  -5.197525 -2.697429 0.541623
H  -4.115625 -3.968691 1.103515
H  -4.086829 -3.475596 -0.584002
H  -2.55465 -0.810429 2.470118
H  -3.035328 -2.446382 2.917312
H  -4.251003 -1.26471 2.44195
H  -4.270251 -1.439087 -1.762069
H  -3.400795 0.78098 -4.275937
H  -4.338094 -0.685393 -3.974904
H  -2.741532 -0.776151 -4.725999
H  -0.768017 0.163303 -3.419693
H  -0.731815 -0.174253 -1.693705
H  -1.422981 1.328905 -2.291934
H  2.370498 -3.351729 0.350189
H  1.966986 -2.216798 1.639132
H  2.362976 0.100175 1.298591
H  2.107487 -2.481453 -2.10769
H  2.61098 -0.572017 -3.587089
H  2.926516 1.691689 -2.640854
H  0.247761 1.846255 0.269707
H  3.777376 3.819073 1.706868
H  -1.042423 2.822068 2.111411
H  2.462629 4.818886 3.542804
H  0.045737 4.314601 3.761786
elementType: O C H
totalener: -1117.86686834 hartree
nucrepener: 2332.65653229 hartree
electener: -3450.52340062 hartree
oneelecener: -6155.25738593 hartree
twoeener: 2704.73398531 hartree
cpcmener: -0.02364093 hartree
kineticenergy: 1112.81586034 hartree
xcener: -110.228263460509 hartree
chargesum: -0.0000000
charge: -0.287849 -0.473374 -0.333001 0.164269 -0.041783 -0.064536 -0.293353 -0.276150 -0.290214 0.365754 0.013280 -0.225842 -0.245923 0.088922 0.003588 -0.167840 -0.225468 0.268056 -0.143016 -0.232724 0.270683 -0.166906 -0.235210 -0.166844 -0.132784 -0.172673 0.101742 0.089295 0.100562 0.098254 0.089519 0.093064 0.097547 0.092976 0.123722 0.096054 0.087369 0.094850 0.098462 0.041918 0.109598 0.125538 0.111582 0.138410 0.140545 0.156548 0.145669 0.152973 0.144154 0.155739 0.157459 0.157388
qa: -0.2878 -0.4734 -0.3330 0.1643 -0.0418 -0.0645 -0.2934 -0.2761 -0.2902 0.3658 0.0133 -0.2258 -0.2459 0.0889 0.0036 -0.1678 -0.2255 0.2681 -0.1430 -0.2327 0.2707 -0.1669 -0.2352 -0.1668 -0.1328 -0.1727 0.1017 0.0893 0.1006 0.0983 0.0895 0.0931 0.0975 0.0930 0.1237 0.0961 0.0874 0.0948 0.0985 0.0419 0.1096 0.1255 0.1116 0.1384 0.1405 0.1565 0.1457 0.1530 0.1442 0.1557 0.1575 0.1574
va: 2.1107 2.0211 2.0788 3.7210 3.8305 3.7846 3.9134 3.8802 3.8747 4.1788 3.7102 3.9291 3.9533 3.8122 3.6013 3.8969 3.9218 3.7244 3.8732 3.9849 3.7107 3.8712 3.9917 3.9154 3.8956 3.8952 1.0235 1.0340 0.9990 1.0026 1.0013 1.0197 0.9995 1.0012 1.0046 0.9947 1.0079 0.9956 1.0037 1.0099 0.9972 0.9934 1.0106 1.0170 1.0071 0.9902 1.0059 0.9899 1.0086 0.9924 0.9891 0.9904
dispcorr: -0.027788954 hartree
energy: -1117.894657291426
dipole: -23.99195 23.46219 -0.52976 -7.33318 6.56309 -0.77008 -7.06266 6.38137 -0.68129
magnitude: 1.15664 au
magnitude: 2.93996 debye
