program: Orca
programVersion: 5.0.2
elementType: O O O C C C C C C C C C C C C C C C C C C C C C C C H H H H H H H H H H H H H H H H H H H H H H H H H H
charge: 0
multiplicity: 1
keywords: wb97x-d3
keywords: def2-TZVPP
keywords: def2/J RIJCOSX
keywords: DEFGRID2
keywords: scfconv7
keywords: smallprint printgap noloewdin
keywords: NOSOSCF
formula: C23H26O3
InChI: InChI=1/C23H26O3/c1-16(2)13-20-21(23(20,3)4)22(24)25-15-17-9-8-12-19(14-17)26-18-10-6-5-7-11-18/h5-14,20-21H,15H2,1-4H3
52 atoms
O  0.299439 -2.659389 0.409559
O  -0.410584 -0.779718 1.385691
O  3.085949 2.369714 -0.415454
C  -3.264879 -2.008979 1.146332
C  -2.998001 -1.25541 -0.109106
C  -1.98184 -2.283169 0.381417
C  -4.264839 -3.140502 1.120661
C  -3.249807 -1.270975 2.463245
C  -3.7418 -1.494111 -1.372401
C  -0.653272 -1.808211 0.798315
C  -3.240936 -1.310571 -2.59753
C  -4.064166 -1.558557 -3.824161
C  -1.834742 -0.863001 -2.852761
C  1.661827 -2.239496 0.554491
C  1.982118 -1.128355 -0.405885
C  2.415435 0.102495 0.067065
C  1.803725 -1.319893 -1.773903
C  2.636164 1.145844 -0.823266
C  2.043628 -0.276947 -2.654285
C  2.44813 0.96477 -2.184976
C  2.589263 2.975203 0.70353
C  3.442873 3.861885 1.348145
C  1.291423 2.784626 1.165228
C  2.997272 4.557198 2.461784
C  0.86532 3.478484 2.289973
C  1.709425 4.365083 2.943814
H  -2.672027 -0.229761 0.048586
H  -1.969542 -3.218445 -0.166434
H  -5.281395 -2.761508 1.246736
H  -4.070885 -3.837805 1.938096
H  -4.235072 -3.709838 0.191451
H  -2.89718 -1.912575 3.273235
H  -4.266352 -0.959669 2.71319
H  -2.631449 -0.37679 2.449075
H  -4.773341 -1.823281 -1.280742
H  -4.139246 -0.656883 -4.437703
H  -5.075367 -1.886606 -3.583231
H  -3.603745 -2.322919 -4.456199
H  -1.820149 0.037958 -3.471823
H  -1.284088 -1.625575 -3.410659
H  -1.277807 -0.64766 -1.942748
H  2.24591 -3.13214 0.331791
H  1.874275 -1.949201 1.585052
H  2.560526 0.245388 1.131241
H  1.473719 -2.279178 -2.153364
H  1.903862 -0.423809 -3.717493
H  2.620618 1.785514 -2.869738
H  4.448875 4.007545 0.974542
H  0.61114 2.104908 0.668078
H  3.667164 5.247965 2.957569
H  -0.143143 3.32264 2.651282
H  1.366854 4.902071 3.818497
elementType: O C H
totalener: -1117.86751029 hartree
nucrepener: 2285.32726924 hartree
electener: -3403.19477953 hartree
oneelecener: -6060.55011046 hartree
twoeener: 2657.35533093 hartree
cpcmener: -0.02335939 hartree
kineticenergy: 1112.80569619 hartree
xcener: -110.227059247577 hartree
chargesum: 0.0000000
charge: -0.286647 -0.474818 -0.328317 0.170132 -0.032059 -0.092686 -0.291705 -0.283018 -0.291563 0.372886 -0.002628 -0.229692 -0.239607 0.092732 0.061790 -0.226986 -0.304429 0.301038 -0.090843 -0.251139 0.315044 -0.264641 -0.209526 -0.116132 -0.144648 -0.194817 0.107622 0.089382 0.098841 0.097307 0.092108 0.098819 0.092672 0.093831 0.121999 0.095586 0.089400 0.095101 0.101331 0.098367 0.072913 0.125474 0.112081 0.143157 0.141650 0.157124 0.146315 0.144346 0.153022 0.157054 0.159414 0.157365
qa: -0.2866 -0.4748 -0.3283 0.1701 -0.0321 -0.0927 -0.2917 -0.2830 -0.2916 0.3729 -0.0026 -0.2297 -0.2396 0.0927 0.0618 -0.2270 -0.3044 0.3010 -0.0908 -0.2511 0.3150 -0.2646 -0.2095 -0.1161 -0.1446 -0.1948 0.1076 0.0894 0.0988 0.0973 0.0921 0.0988 0.0927 0.0938 0.1220 0.0956 0.0894 0.0951 0.1013 0.0984 0.0729 0.1255 0.1121 0.1432 0.1417 0.1571 0.1463 0.1443 0.1530 0.1571 0.1594 0.1574
va: 2.1113 2.0233 2.0840 3.6852 3.8341 3.8017 3.9124 3.8841 3.8905 4.1645 3.7253 3.9283 3.9402 3.8073 3.5530 3.9447 3.9345 3.6994 3.8322 4.0327 3.6874 4.0081 3.8974 3.8817 3.8966 3.9151 1.0217 1.0334 0.9994 1.0030 1.0013 0.9994 1.0007 1.0204 1.0032 0.9963 1.0065 0.9961 1.0001 0.9972 1.0072 0.9923 1.0103 1.0088 1.0099 0.9888 1.0060 1.0097 1.0067 0.9891 0.9908 0.9908
dispcorr: -0.026309192 hartree
energy: -1117.893819485297
dipole: -25.84799 25.30281 -0.54519 -11.23134 10.25378 -0.97756 -5.33572 4.80032 -0.53541
magnitude: 1.24077 au
magnitude: 3.15379 debye
