program: Orca
programVersion: 5.0.2
elementType: O O O C C C C C C C C C C C C C C C C C C C C C C C H H H H H H H H H H H H H H H H H H H H H H H H H H
charge: 0
multiplicity: 1
keywords: wb97x-d3
keywords: def2-TZVPP
keywords: def2/J RIJCOSX
keywords: DEFGRID2
keywords: scfconv7
keywords: smallprint printgap noloewdin
keywords: NOSOSCF
formula: C23H26O3
InChI: InChI=1/C23H26O3/c1-16(2)13-20-21(23(20,3)4)22(24)25-15-17-9-8-12-19(14-17)26-18-10-6-5-7-11-18/h5-14,20-21H,15H2,1-4H3
52 atoms
O  0.147004 -2.115599 -1.61252
O  -0.564913 -0.125311 -0.886655
O  3.877855 1.816961 0.513238
C  -2.202961 -2.104362 0.992382
C  -3.098056 -1.36828 0.037604
C  -1.878114 -2.08727 -0.492163
C  -2.643028 -3.431882 1.559379
C  -1.367199 -1.300261 1.958114
C  -4.437875 -1.859604 -0.341612
C  -0.727636 -1.316881 -1.000331
C  -5.563283 -1.139369 -0.387761
C  -6.854208 -1.760624 -0.830473
C  -5.658079 0.315977 -0.040376
C  1.375045 -1.532451 -2.062588
C  2.250622 -1.143257 -0.904838
C  2.665461 0.17199 -0.756392
C  2.629099 -2.096706 0.037828
C  3.435227 0.533954 0.341805
C  3.411706 -1.727335 1.119827
C  3.811544 -0.408026 1.285469
C  3.013838 2.865955 0.367162
C  3.564602 4.068755 -0.056521
C  1.659129 2.77701 0.668249
C  2.754928 5.187838 -0.179808
C  0.860233 3.903502 0.528282
C  1.39808 5.110749 0.104355
H  -2.989137 -0.28981 0.077389
H  -2.049094 -3.029335 -1.002904
H  -3.304884 -3.281452 2.415072
H  -1.779905 -4.003114 1.907337
H  -3.172568 -4.05067 0.835908
H  -1.134072 -0.300046 1.597453
H  -0.424339 -1.806808 2.177348
H  -1.904127 -1.18608 2.902032
H  -4.499544 -2.906015 -0.626807
H  -7.276783 -1.221873 -1.683264
H  -7.6053 -1.716844 -0.037011
H  -6.733062 -2.80436 -1.121183
H  -6.52797 0.502368 0.59372
H  -5.799494 0.92154 -0.939964
H  -4.784636 0.701127 0.482357
H  1.181361 -0.681211 -2.718114
H  1.843201 -2.313813 -2.660884
H  2.372418 0.914514 -1.489267
H  2.314555 -3.127478 -0.071555
H  3.706524 -2.468421 1.851346
H  4.410743 -0.112775 2.137581
H  4.62182 4.125298 -0.284409
H  1.219993 1.84732 1.007777
H  3.189641 6.122327 -0.510766
H  -0.19492 3.83096 0.75891
H  0.766738 5.983194 -0.000145
elementType: O C H
totalener: -1117.87003685 hartree
nucrepener: 2243.46798901 hartree
electener: -3361.33802586 hartree
oneelecener: -5976.88802726 hartree
twoeener: 2615.55000140 hartree
cpcmener: -0.02507866 hartree
kineticenergy: 1112.80974428 hartree
xcener: -110.227715733493 hartree
chargesum: -0.0000000
charge: -0.283177 -0.465284 -0.331244 0.107040 0.042559 -0.094384 -0.271367 -0.267892 -0.286680 0.381661 -0.036132 -0.219981 -0.261306 0.089294 0.039185 -0.201161 -0.261104 0.268698 -0.108933 -0.240407 0.289440 -0.249107 -0.183490 -0.122832 -0.158371 -0.186963 0.089364 0.089494 0.097598 0.097377 0.087546 0.086265 0.094057 0.099132 0.115578 0.092411 0.093693 0.087296 0.092356 0.100719 0.092800 0.114135 0.126540 0.141860 0.139952 0.157180 0.147060 0.144364 0.153729 0.156628 0.157642 0.157162
qa: -0.2832 -0.4653 -0.3312 0.1070 0.0426 -0.0944 -0.2714 -0.2679 -0.2867 0.3817 -0.0361 -0.2200 -0.2613 0.0893 0.0392 -0.2012 -0.2611 0.2687 -0.1089 -0.2404 0.2894 -0.2491 -0.1835 -0.1228 -0.1584 -0.1870 0.0894 0.0895 0.0976 0.0974 0.0875 0.0863 0.0941 0.0991 0.1156 0.0924 0.0937 0.0873 0.0924 0.1007 0.0928 0.1141 0.1265 0.1419 0.1400 0.1572 0.1471 0.1444 0.1537 0.1566 0.1576 0.1572
va: 2.1181 2.0404 2.0764 3.7006 3.7784 3.8116 3.9053 3.9085 3.8882 4.2205 3.7466 3.9241 3.9432 3.8044 3.5792 3.9326 3.9528 3.7219 3.8740 4.0228 3.7017 3.9954 3.8824 3.8904 3.9095 3.9048 1.0337 1.0358 1.0018 1.0019 1.0058 1.0158 1.0013 1.0019 1.0115 0.9951 0.9964 1.0091 0.9984 0.9953 1.0074 1.0094 0.9920 1.0097 1.0107 0.9889 1.0054 1.0090 0.9968 0.9892 0.9915 0.9905
dispcorr: -0.024636289 hartree
energy: -1117.894673134705
dipole: -32.45598 31.78278 -0.67320 -9.90702 8.90923 -0.99779 5.41340 -5.42706 -0.01366
magnitude: 1.20373 au
magnitude: 3.05965 debye
