program: Orca
programVersion: 5.0.2
elementType: O O O C C C C C C C C C C C C C C C C C C C C C C C H H H H H H H H H H H H H H H H H H H H H H H H H H
charge: 0
multiplicity: 1
keywords: wb97x-d3
keywords: def2-TZVPP
keywords: def2/J RIJCOSX
keywords: DEFGRID2
keywords: scfconv7
keywords: smallprint printgap noloewdin
keywords: NOSOSCF
formula: C23H26O3
InChI: InChI=1/C23H26O3/c1-16(2)13-20-21(23(20,3)4)22(24)25-15-17-9-8-12-19(14-17)26-18-10-6-5-7-11-18/h5-14,20-21H,15H2,1-4H3
52 atoms
O  0.366691 -2.875328 0.457812
O  -0.168041 -1.988845 -1.521482
O  2.781238 1.449052 1.429179
C  -2.27233 -0.585767 0.434943
C  -2.934478 -1.500446 -0.554132
C  -1.774517 -2.014341 0.254843
C  -2.973963 -0.294526 1.73787
C  -1.462666 0.579544 -0.076651
C  -4.289292 -2.062273 -0.323377
C  -0.474252 -2.277131 -0.38974
C  -5.41973 -1.574525 -0.841059
C  -6.743192 -2.220195 -0.563708
C  -5.475342 -0.363191 -1.719601
C  1.705075 -3.088304 0.012457
C  2.466365 -1.803603 -0.163891
C  2.264127 -0.732757 0.702278
C  3.393604 -1.684026 -1.190806
C  2.983383 0.437579 0.528157
C  4.120782 -0.51116 -1.344023
C  3.919791 0.5614 -0.490863
C  2.431944 2.691285 0.983251
C  1.698837 2.896116 -0.180194
C  2.804478 3.766111 1.780588
C  1.347479 4.19013 -0.540044
C  2.439726 5.051493 1.410505
C  1.714446 5.272432 0.247474
H  -2.69349 -1.278445 -1.590137
H  -2.009768 -2.677653 1.081077
H  -3.520703 -1.154962 2.124013
H  -3.690242 0.520913 1.612325
H  -2.255929 0.01223 2.50161
H  -2.110297 1.450462 -0.199217
H  -0.99286 0.388521 -1.03984
H  -0.680071 0.855622 0.63412
H  -4.354177 -2.938009 0.316576
H  -6.648639 -3.092636 0.083128
H  -7.228668 -2.539319 -1.490065
H  -7.429911 -1.517793 -0.083247
H  -6.106909 0.407638 -1.269416
H  -5.927309 -0.602182 -2.686002
H  -4.49886 0.080812 -1.907863
H  1.720768 -3.674865 -0.909118
H  2.159665 -3.696961 0.795516
H  1.547371 -0.794602 1.512808
H  3.546356 -2.506635 -1.878659
H  4.845093 -0.42697 -2.143948
H  4.48479 1.476748 -0.616186
H  1.395682 2.065662 -0.805403
H  3.373915 3.594571 2.685461
H  0.777734 4.346821 -1.446929
H  2.732204 5.885479 2.035453
H  1.437792 6.27778 -0.041206
elementType: O C H
totalener: -1117.86933306 hartree
nucrepener: 2257.73797483 hartree
electener: -3375.60730789 hartree
oneelecener: -6005.20968392 hartree
twoeener: 2629.60237603 hartree
cpcmener: -0.02546256 hartree
kineticenergy: 1112.80595932 hartree
xcener: -110.226949168113 hartree
chargesum: 0.0000000
charge: -0.289354 -0.455978 -0.332222 0.167949 -0.020889 -0.116135 -0.271994 -0.312548 -0.258255 0.382136 -0.034709 -0.229739 -0.249379 0.093876 0.043873 -0.288679 -0.203285 0.251936 -0.132012 -0.174650 0.302115 -0.201234 -0.244521 -0.168652 -0.128203 -0.182081 0.098481 0.092904 0.092151 0.096356 0.099241 0.103602 0.098947 0.092124 0.119721 0.088823 0.094390 0.093231 0.096022 0.098772 0.086970 0.116038 0.121424 0.135682 0.141110 0.158280 0.157027 0.154613 0.144792 0.158195 0.157090 0.156650
qa: -0.2894 -0.4560 -0.3322 0.1679 -0.0209 -0.1161 -0.2720 -0.3125 -0.2583 0.3821 -0.0347 -0.2297 -0.2494 0.0939 0.0439 -0.2887 -0.2033 0.2519 -0.1320 -0.1746 0.3021 -0.2012 -0.2445 -0.1687 -0.1282 -0.1821 0.0985 0.0929 0.0922 0.0964 0.0992 0.1036 0.0989 0.0921 0.1197 0.0888 0.0944 0.0932 0.0960 0.0988 0.0870 0.1160 0.1214 0.1357 0.1411 0.1583 0.1570 0.1546 0.1448 0.1582 0.1571 0.1566
va: 2.1134 2.0495 2.0568 3.6706 3.8137 3.8592 3.9009 3.8937 3.8630 4.2212 3.7054 3.9283 3.9396 3.7984 3.6069 4.0171 3.9712 3.7474 3.8947 3.9384 3.6600 3.8670 4.0002 3.9269 3.8971 3.9016 1.0258 1.0362 1.0021 1.0023 1.0037 1.0040 1.0147 1.0005 1.0073 1.0076 0.9956 0.9963 0.9976 0.9986 1.0090 1.0085 0.9923 1.0248 1.0029 0.9901 0.9954 0.9971 1.0089 0.9915 0.9892 0.9906
dispcorr: -0.026025582 hartree
energy: -1117.895358644909
dipole: -30.71884 30.33323 -0.38562 0.19588 -0.11320 0.08268 -2.52818 2.83257 0.30438
magnitude: 0.49818 au
magnitude: 1.26627 debye
