program: Orca
programVersion: 5.0.2
elementType: O O O C C C C C C C C C C C C C C C C C C C C C C C H H H H H H H H H H H H H H H H H H H H H H H H H H
charge: 0
multiplicity: 1
keywords: wb97x-d3
keywords: def2-TZVPP
keywords: def2/J RIJCOSX
keywords: DEFGRID2
keywords: scfconv7
keywords: smallprint printgap noloewdin
keywords: NOSOSCF
formula: C23H26O3
InChI: InChI=1/C23H26O3/c1-16(2)13-20-21(23(20,3)4)22(24)25-15-17-9-8-12-19(14-17)26-18-10-6-5-7-11-18/h5-14,20-21H,15H2,1-4H3
52 atoms
O  0.246459 -2.814587 0.545953
O  -0.358797 -2.033739 -1.458729
O  2.619563 1.515575 1.347693
C  -2.319172 -0.437029 0.490988
C  -3.071265 -1.407558 -0.375365
C  -1.865079 -1.884968 0.399324
C  -2.895554 -0.009045 1.818192
C  -1.525204 0.655867 -0.182904
C  -4.404156 -1.933949 -0.021736
C  -0.615497 -2.238962 -0.297223
C  -5.441018 -2.018576 -0.860133
C  -6.748472 -2.601218 -0.418341
C  -5.374686 -1.555812 -2.292128
C  1.569073 -3.053056 0.072165
C  2.333583 -1.776317 -0.147946
C  2.116598 -0.672531 0.670201
C  3.282573 -1.699328 -1.159459
C  2.84228 0.490758 0.469907
C  4.012778 -0.532853 -1.341615
C  3.799827 0.57305 -0.533799
C  2.469016 2.797658 0.901464
C  1.853089 3.108361 -0.305342
C  2.910515 3.804756 1.75011
C  1.691059 4.441876 -0.656727
C  2.731215 5.131583 1.389653
C  2.126174 5.457523 0.183345
H  -2.894015 -1.2742 -1.43806
H  -2.060799 -2.473876 1.289296
H  -3.607025 0.808534 1.683412
H  -2.102651 0.350532 2.477448
H  -3.411194 -0.814711 2.339316
H  -2.157932 1.534742 -0.323509
H  -1.144194 0.372769 -1.162354
H  -0.676749 0.962243 0.433574
H  -4.533467 -2.292339 0.995344
H  -7.559782 -1.875584 -0.523459
H  -6.724313 -2.930405 0.620831
H  -7.023896 -3.460508 -1.036338
H  -5.037939 -0.521309 -2.377667
H  -6.351478 -1.616817 -2.772178
H  -4.689676 -2.164871 -2.886504
H  1.557901 -3.660982 -0.835185
H  2.039209 -3.645992 0.85802
H  1.385151 -0.702347 1.46911
H  3.450255 -2.548776 -1.81022
H  4.75438 -0.480161 -2.128318
H  4.374078 1.47877 -0.683638
H  1.494557 2.328965 -0.966387
H  3.3853 3.546909 2.688628
H  1.212129 4.684307 -1.596753
H  3.073874 5.913225 2.055435
H  1.992372 6.493681 -0.098168
elementType: O C H
totalener: -1117.86887729 hartree
nucrepener: 2246.16836716 hartree
electener: -3364.03724445 hartree
oneelecener: -5982.06847393 hartree
twoeener: 2618.03122948 hartree
cpcmener: -0.02557850 hartree
kineticenergy: 1112.80017997 hartree
xcener: -110.226764075961 hartree
chargesum: 0.0000000
charge: -0.289150 -0.455903 -0.331813 0.120253 0.041477 -0.090808 -0.272756 -0.282072 -0.301707 0.365318 -0.010871 -0.222621 -0.284567 0.095660 0.052687 -0.301000 -0.215834 0.271582 -0.127274 -0.190868 0.309251 -0.200247 -0.256856 -0.159058 -0.122216 -0.186256 0.091449 0.089284 0.098100 0.098188 0.087965 0.104315 0.097113 0.084696 0.114850 0.095670 0.083819 0.097606 0.103510 0.094115 0.103482 0.115707 0.120913 0.135948 0.141032 0.158423 0.155827 0.154760 0.144902 0.158926 0.157404 0.157647
qa: -0.2891 -0.4559 -0.3318 0.1203 0.0415 -0.0908 -0.2728 -0.2821 -0.3017 0.3653 -0.0109 -0.2226 -0.2846 0.0957 0.0527 -0.3010 -0.2158 0.2716 -0.1273 -0.1909 0.3093 -0.2002 -0.2569 -0.1591 -0.1222 -0.1863 0.0914 0.0893 0.0981 0.0982 0.0880 0.1043 0.0971 0.0847 0.1148 0.0957 0.0838 0.0976 0.1035 0.0941 0.1035 0.1157 0.1209 0.1359 0.1410 0.1584 0.1558 0.1548 0.1449 0.1589 0.1574 0.1576
va: 2.1105 2.0470 2.0554 3.6968 3.7999 3.8243 3.9072 3.8993 3.9015 4.2279 3.6970 3.9215 3.9404 3.7976 3.6121 4.0173 3.9813 3.7348 3.8920 3.9355 3.6535 3.8859 4.0127 3.9150 3.8911 3.9050 1.0290 1.0363 1.0017 1.0025 1.0057 1.0027 1.0171 1.0024 1.0107 0.9932 1.0105 0.9923 0.9958 1.0047 0.9963 1.0095 0.9923 1.0264 1.0033 0.9900 0.9961 0.9987 1.0092 0.9908 0.9892 0.9905
dispcorr: -0.025228786 hartree
energy: -1117.894106076579
dipole: -29.44918 29.27747 -0.17171 -1.94309 2.05972 0.11663 -3.33985 3.63134 0.29149
magnitude: 0.35784 au
magnitude: 0.90957 debye
