program: Orca
programVersion: 5.0.2
elementType: O O O C C C C C C C C C C C C C C C C C C C C C C C H H H H H H H H H H H H H H H H H H H H H H H H H H
charge: 0
multiplicity: 1
keywords: wb97x-d3
keywords: def2-TZVPP
keywords: def2/J RIJCOSX
keywords: DEFGRID2
keywords: scfconv7
keywords: smallprint printgap noloewdin
keywords: NOSOSCF
formula: C23H26O3
InChI: InChI=1/C23H26O3/c1-16(2)13-20-21(23(20,3)4)22(24)25-15-17-9-8-12-19(14-17)26-18-10-6-5-7-11-18/h5-14,20-21H,15H2,1-4H3
52 atoms
O  0.010191 -1.852166 -1.755733
O  -0.816889 -0.008923 -0.801411
O  3.978399 1.830418 0.702037
C  -2.406987 -2.263848 0.754819
C  -3.313204 -1.478076 -0.145648
C  -2.046717 -2.06075 -0.711406
C  -2.811015 -3.663562 1.145059
C  -1.643988 -1.543124 1.838584
C  -4.625699 -2.009421 -0.59594
C  -0.922057 -1.180188 -1.077459
C  -5.786242 -1.792335 0.028082
C  -7.07108 -2.35475 -0.498223
C  -5.908374 -0.986218 1.284258
C  1.226654 -1.165704 -2.052147
C  2.02669 -0.882961 -0.810745
C  2.619028 0.361569 -0.647439
C  2.186445 -1.859837 0.168563
C  3.350976 0.634576 0.50167
C  2.92766 -1.578605 1.305677
C  3.50794 -0.331452 1.484593
C  3.398709 3.004991 0.307734
C  4.252435 3.993915 -0.162993
C  2.033934 3.245839 0.423393
C  3.736769 5.231308 -0.520321
C  1.531231 4.483503 0.046997
C  2.37478 5.480775 -0.424104
H  -3.276802 -0.404204 0.017186
H  -2.146509 -2.947494 -1.328872
H  -3.49069 -3.639311 1.999808
H  -1.937481 -4.250674 1.435363
H  -3.315414 -4.196649 0.339835
H  -1.456849 -0.495662 1.610618
H  -0.681674 -2.022722 2.031173
H  -2.213952 -1.574319 2.769571
H  -4.628641 -2.617357 -1.496509
H  -7.789151 -1.56042 -0.719536
H  -7.548002 -3.003691 0.241221
H  -6.923097 -2.935228 -1.409114
H  -6.553055 -0.116837 1.127992
H  -4.951487 -0.628336 1.661278
H  -6.377361 -1.576414 2.076144
H  1.02818 -0.246559 -2.607195
H  1.76702 -1.841624 -2.715249
H  2.495884 1.116762 -1.414964
H  1.730951 -2.835502 0.053379
H  3.051106 -2.335963 2.069098
H  4.079723 -0.109168 2.376818
H  5.314004 3.794898 -0.243287
H  1.362534 2.484738 0.801762
H  4.406462 5.999196 -0.886466
H  0.468301 4.668645 0.135922
H  1.973782 6.44356 -0.712718
elementType: O C H
totalener: -1117.86909463 hartree
nucrepener: 2220.14841845 hartree
electener: -3338.01751308 hartree
oneelecener: -5930.15856709 hartree
twoeener: 2592.14105401 hartree
cpcmener: -0.02470367 hartree
kineticenergy: 1112.80760744 hartree
xcener: -110.227546820057 hartree
chargesum: 0.0000000
charge: -0.286933 -0.461790 -0.328989 0.130314 -0.020232 -0.093021 -0.276356 -0.296467 -0.253043 0.377359 -0.038723 -0.228266 -0.246921 0.096089 0.062661 -0.227444 -0.290019 0.294670 -0.095104 -0.256614 0.294667 -0.254401 -0.198388 -0.118897 -0.143558 -0.190079 0.099768 0.093388 0.097209 0.100256 0.092128 0.097841 0.095889 0.099669 0.118910 0.094182 0.093652 0.088452 0.101660 0.086135 0.095202 0.114666 0.122026 0.141349 0.140716 0.156771 0.145409 0.144442 0.156126 0.157463 0.158870 0.157305
qa: -0.2869 -0.4618 -0.3290 0.1303 -0.0202 -0.0930 -0.2764 -0.2965 -0.2530 0.3774 -0.0387 -0.2283 -0.2469 0.0961 0.0627 -0.2274 -0.2900 0.2947 -0.0951 -0.2566 0.2947 -0.2544 -0.1984 -0.1189 -0.1436 -0.1901 0.0998 0.0934 0.0972 0.1003 0.0921 0.0978 0.0959 0.0997 0.1189 0.0942 0.0937 0.0885 0.1017 0.0861 0.0952 0.1147 0.1220 0.1413 0.1407 0.1568 0.1454 0.1444 0.1561 0.1575 0.1589 0.1573
va: 2.1151 2.0433 2.0784 3.6731 3.8168 3.8270 3.9043 3.8950 3.8547 4.2295 3.7104 3.9283 3.9362 3.7991 3.5823 3.9503 3.9488 3.7106 3.8688 4.0228 3.6922 4.0101 3.9061 3.8812 3.8923 3.9093 1.0258 1.0348 1.0008 1.0031 1.0023 1.0149 1.0028 1.0024 1.0073 0.9955 0.9965 1.0075 0.9987 1.0086 0.9980 1.0108 0.9919 1.0076 1.0132 0.9888 1.0069 1.0091 1.0003 0.9891 0.9905 0.9907
dispcorr: -0.024981969 hartree
energy: -1117.894076596737
dipole: -33.25811 32.58512 -0.67299 -13.91408 12.97567 -0.93841 6.92638 -7.00081 -0.07443
magnitude: 1.15718 au
magnitude: 2.94131 debye
