program: Orca
programVersion: 5.0.2
elementType: O O O C C C C C C C C C C C C C C C C C C C C C C C H H H H H H H H H H H H H H H H H H H H H H H H H H
charge: 0
multiplicity: 1
keywords: wb97x-d3
keywords: def2-TZVPP
keywords: def2/J RIJCOSX
keywords: DEFGRID2
keywords: scfconv7
keywords: smallprint printgap noloewdin
keywords: NOSOSCF
formula: C23H26O3
InChI: InChI=1/C23H26O3/c1-16(2)13-20-21(23(20,3)4)22(24)25-15-17-9-8-12-19(14-17)26-18-10-6-5-7-11-18/h5-14,20-21H,15H2,1-4H3
52 atoms
O  -0.125092 -1.886252 -1.581863
O  -0.747382 0.071273 -0.699127
O  3.866594 1.696891 0.652334
C  -2.288262 -1.984816 1.190648
C  -3.23419 -1.206393 0.339417
C  -2.057625 -1.895926 -0.31273
C  -2.690417 -3.347585 1.69872
C  -1.385808 -1.235148 2.140147
C  -4.619558 -1.665605 0.057479
C  -0.938721 -1.110729 -0.863304
C  -5.303138 -1.384758 -1.054933
C  -6.710073 -1.861037 -1.250503
C  -4.736221 -0.585769 -2.18831
C  1.084737 -1.304472 -2.080782
C  2.062027 -1.055377 -0.966698
C  2.505241 0.231945 -0.698657
C  2.504416 -2.117721 -0.1816
C  3.370166 0.456424 0.365514
C  3.376535 -1.883803 0.869115
C  3.805961 -0.595785 1.156489
C  3.070485 2.806676 0.611394
C  1.714614 2.783659 0.918253
C  3.703046 4.003767 0.299144
C  0.996887 3.971948 0.895903
C  2.974601 5.18326 0.292995
C  1.617128 5.173911 0.585146
H  -3.116373 -0.12799 0.418881
H  -2.269739 -2.810917 -0.855206
H  -3.29258 -3.903127 0.979436
H  -3.26652 -3.264388 2.622746
H  -1.804886 -3.947765 1.917473
H  -1.857068 -1.173157 3.123239
H  -1.181323 -0.215806 1.817558
H  -0.429416 -1.746865 2.267187
H  -5.110735 -2.247297 0.83288
H  -6.79446 -2.476118 -2.15053
H  -7.39405 -1.019274 -1.38838
H  -7.067769 -2.449731 -0.40567
H  -3.725547 -0.226626 -2.000338
H  -5.36439 0.283446 -2.400533
H  -4.714562 -1.178776 -3.106743
H  0.876025 -0.391237 -2.64108
H  1.471942 -2.044249 -2.780897
H  2.164244 1.055458 -1.314687
H  2.17043 -3.126491 -0.392211
H  3.723058 -2.708618 1.478206
H  4.47915 -0.407424 1.983363
H  1.212243 1.858343 1.171512
H  4.761105 4.006557 0.067956
H  -0.059782 3.951691 1.129957
H  3.473532 6.113147 0.051636
H  1.048717 6.094526 0.573588
elementType: O C H
totalener: -1117.86864873 hartree
nucrepener: 2252.56939898 hartree
electener: -3370.43804771 hartree
oneelecener: -5995.08770044 hartree
twoeener: 2624.64965273 hartree
cpcmener: -0.02360161 hartree
kineticenergy: 1112.80343771 hartree
xcener: -110.225723737506 hartree
chargesum: 0.0000000
charge: -0.283334 -0.470531 -0.328722 0.154436 -0.028590 -0.103226 -0.290996 -0.267625 -0.287481 0.384426 -0.016346 -0.228735 -0.240880 0.087345 0.029919 -0.209551 -0.258198 0.289465 -0.107775 -0.250463 0.307225 -0.201064 -0.258435 -0.151024 -0.118708 -0.189413 0.104518 0.092657 0.092582 0.098568 0.097438 0.098272 0.085530 0.095855 0.121713 0.093823 0.095257 0.089050 0.078744 0.099511 0.096983 0.113948 0.125988 0.142928 0.140201 0.157923 0.145922 0.155449 0.143621 0.157810 0.157433 0.156556
qa: -0.2833 -0.4705 -0.3287 0.1544 -0.0286 -0.1032 -0.2910 -0.2676 -0.2875 0.3844 -0.0163 -0.2287 -0.2409 0.0873 0.0299 -0.2096 -0.2582 0.2895 -0.1078 -0.2505 0.3072 -0.2011 -0.2584 -0.1510 -0.1187 -0.1894 0.1045 0.0927 0.0926 0.0986 0.0974 0.0983 0.0855 0.0959 0.1217 0.0938 0.0953 0.0891 0.0787 0.0995 0.0970 0.1139 0.1260 0.1429 0.1402 0.1579 0.1459 0.1554 0.1436 0.1578 0.1574 0.1566
va: 2.1155 2.0297 2.0829 3.7116 3.8302 3.7894 3.9077 3.8924 3.8869 4.1814 3.7101 3.9306 3.9364 3.8077 3.5908 3.9261 3.9627 3.7109 3.8759 4.0245 3.6879 3.8975 4.0007 3.9031 3.8843 3.9104 1.0243 1.0323 1.0016 0.9997 1.0028 1.0030 1.0153 1.0007 1.0030 0.9964 0.9961 1.0066 1.0188 0.9996 0.9985 1.0096 0.9923 1.0101 1.0101 0.9887 1.0066 0.9952 1.0099 0.9913 0.9889 0.9909
dispcorr: -0.025216945 hartree
energy: -1117.893865674066
dipole: -30.14134 29.49079 -0.65055 -11.52678 10.50369 -1.02309 1.13349 -1.41302 -0.27953
magnitude: 1.24422 au
magnitude: 3.16255 debye
