program: Orca
programVersion: 5.0.2
elementType: O O O C C C C C C C C C C C C C C C C C C C C C C C H H H H H H H H H H H H H H H H H H H H H H H H H H
charge: 0
multiplicity: 1
keywords: wb97x-d3
keywords: def2-TZVPP
keywords: def2/J RIJCOSX
keywords: DEFGRID2
keywords: scfconv7
keywords: smallprint printgap noloewdin
keywords: NOSOSCF
formula: C23H26O3
InChI: InChI=1/C23H26O3/c1-16(2)13-20-21(23(20,3)4)22(24)25-15-17-9-8-12-19(14-17)26-18-10-6-5-7-11-18/h5-14,20-21H,15H2,1-4H3
52 atoms
O  0.195056 -2.737966 0.633676
O  -0.415862 -2.05271 -1.404062
O  2.608542 1.597709 1.310992
C  -2.437896 -0.410678 0.422297
C  -3.156262 -1.472107 -0.359888
C  -1.927958 -1.84268 0.442718
C  -3.02066 0.096698 1.719146
C  -1.690136 0.657161 -0.33817
C  -4.468994 -2.013817 0.039517
C  -0.671162 -2.207132 -0.23414
C  -5.472253 -2.291621 -0.798234
C  -6.767315 -2.849726 -0.293696
C  -5.38547 -2.069055 -2.285895
C  1.518248 -2.993376 0.16936
C  2.284307 -1.726542 -0.096588
C  2.08573 -0.600324 0.695079
C  3.219116 -1.683206 -1.123447
C  2.817829 0.552523 0.455884
C  3.956348 -0.528058 -1.343903
C  3.764891 0.599206 -0.560321
C  2.563721 2.884002 0.853917
C  1.991181 3.228889 -0.365032
C  3.063588 3.862572 1.702929
C  1.932434 4.567071 -0.729097
C  2.986581 5.196125 1.330134
C  2.42644 5.55529 0.11169
H  -2.986028 -1.417695 -1.430629
H  -2.100181 -2.366579 1.37705
H  -3.769278 0.868694 1.528219
H  -2.238137 0.542178 2.336895
H  -3.494554 -0.685712 2.310625
H  -2.350009 1.509145 -0.515243
H  -1.326137 0.323959 -1.308006
H  -0.834638 1.021714 0.235999
H  -4.61558 -2.208393 1.097831
H  -6.981136 -3.819558 -0.75174
H  -7.605863 -2.197461 -0.553107
H  -6.76716 -2.982182 0.788486
H  -5.237978 -1.016248 -2.535136
H  -6.298271 -2.390503 -2.787443
H  -4.559706 -2.622119 -2.738056
H  1.507941 -3.634174 -0.715262
H  1.987671 -3.557582 0.976622
H  1.365561 -0.604695 1.504813
H  3.369788 -2.549901 -1.755283
H  4.688004 -0.500737 -2.141239
H  4.348224 1.493267 -0.741024
H  1.587872 2.472183 -1.026483
H  3.504019 3.578901 2.650795
H  1.485891 4.835831 -1.67796
H  3.374966 5.956192 1.995811
H  2.372013 6.596203 -0.178678
elementType: O C H
totalener: -1117.86909067 hartree
nucrepener: 2233.30863109 hartree
electener: -3351.17772176 hartree
oneelecener: -5956.37030518 hartree
twoeener: 2605.19258342 hartree
cpcmener: -0.02553116 hartree
kineticenergy: 1112.79641046 hartree
xcener: -110.226145800107 hartree
chargesum: -0.0000000
charge: -0.289929 -0.458495 -0.330593 0.111735 0.037819 -0.079976 -0.275863 -0.276929 -0.296916 0.365498 -0.012078 -0.223992 -0.284698 0.097646 0.056409 -0.306871 -0.220635 0.286427 -0.126095 -0.201608 0.307131 -0.200599 -0.256897 -0.152874 -0.120208 -0.187415 0.090728 0.089146 0.098152 0.097942 0.088326 0.102287 0.094401 0.088604 0.114349 0.096607 0.097186 0.084188 0.105307 0.094852 0.101468 0.115615 0.120419 0.132259 0.140978 0.158458 0.155620 0.154386 0.144651 0.159052 0.157461 0.157561
qa: -0.2899 -0.4585 -0.3306 0.1117 0.0378 -0.0800 -0.2759 -0.2769 -0.2969 0.3655 -0.0121 -0.2240 -0.2847 0.0976 0.0564 -0.3069 -0.2206 0.2864 -0.1261 -0.2016 0.3071 -0.2006 -0.2569 -0.1529 -0.1202 -0.1874 0.0907 0.0891 0.0982 0.0979 0.0883 0.1023 0.0944 0.0886 0.1143 0.0966 0.0972 0.0842 0.1053 0.0949 0.1015 0.1156 0.1204 0.1323 0.1410 0.1585 0.1556 0.1544 0.1447 0.1591 0.1575 0.1576
va: 2.1110 2.0447 2.0610 3.6987 3.8059 3.8091 3.9099 3.9028 3.9035 4.2272 3.6969 3.9204 3.9396 3.7969 3.6128 4.0220 3.9839 3.7255 3.8929 3.9328 3.6631 3.8938 4.0148 3.9053 3.8877 3.9064 1.0291 1.0356 1.0014 1.0021 1.0063 1.0020 1.0179 1.0005 1.0110 0.9927 0.9927 1.0104 0.9952 1.0046 0.9975 1.0098 0.9923 1.0296 1.0035 0.9902 0.9964 0.9992 1.0093 0.9905 0.9892 0.9906
dispcorr: -0.024653348 hartree
energy: -1117.893744016084
dipole: -29.70536 29.55341 -0.15195 -3.17538 3.33507 0.15968 -3.62135 3.91490 0.29355
magnitude: 0.36709 au
magnitude: 0.93308 debye
