program: Orca
programVersion: 5.0.2
elementType: O O O C C C C C C C C C C C C C C C C C C C C C C C H H H H H H H H H H H H H H H H H H H H H H H H H H
charge: 0
multiplicity: 1
keywords: wb97x-d3
keywords: def2-TZVPP
keywords: def2/J RIJCOSX
keywords: DEFGRID2
keywords: scfconv7
keywords: smallprint printgap noloewdin
keywords: NOSOSCF
formula: C23H26O3
InChI: InChI=1/C23H26O3/c1-16(2)13-20-21(23(20,3)4)22(24)25-15-17-9-8-12-19(14-17)26-18-10-6-5-7-11-18/h5-14,20-21H,15H2,1-4H3
52 atoms
O  0.422805 -2.375253 -1.151096
O  0.245091 -2.179384 1.06641
O  2.652946 2.099735 -0.26717
C  -2.822655 -2.286003 0.530007
C  -2.4132 -0.850939 0.58348
C  -1.666033 -1.800385 -0.330636
C  -4.06897 -2.65172 -0.240668
C  -2.584213 -3.173969 1.726172
C  -3.287456 0.224096 0.049001
C  -0.263514 -2.13431 -0.028241
C  -3.01322 1.095309 -0.925749
C  -4.020188 2.12403 -1.344247
C  -1.724941 1.146027 -1.687163
C  1.803228 -2.696745 -1.029245
C  2.659644 -1.548522 -0.56541
C  2.234585 -0.231328 -0.66157
C  3.924253 -1.823139 -0.051567
C  3.049333 0.791646 -0.194295
C  4.746683 -0.789674 0.367035
C  4.309275 0.526489 0.316116
C  1.42786 2.475886 0.207356
C  0.75896 1.791165 1.216848
C  0.883793 3.632032 -0.338283
C  -0.46434 2.270688 1.664719
C  -0.334917 4.102678 0.127551
C  -1.019073 3.423396 1.126466
H  -1.862379 -0.58299 1.483711
H  -1.88787 -1.724535 -1.388731
H  -4.954529 -2.555037 0.391334
H  -4.020857 -3.687879 -0.581666
H  -4.217256 -2.02094 -1.117314
H  -3.486282 -3.204402 2.340665
H  -1.771713 -2.832066 2.362123
H  -2.364915 -4.199144 1.420622
H  -4.255509 0.303356 0.538688
H  -4.956363 2.038822 -0.792497
H  -4.248509 2.03736 -2.410078
H  -3.628955 3.134208 -1.194875
H  -1.366288 2.174995 -1.757087
H  -1.86777 0.801481 -2.715577
H  -0.932981 0.549999 -1.241702
H  2.102926 -3.008347 -2.030972
H  1.939287 -3.556486 -0.368499
H  1.26725 0.012144 -1.083342
H  4.264404 -2.848839 0.026639
H  5.729788 -1.009783 0.762381
H  4.935716 1.335445 0.669664
H  1.174542 0.894069 1.657733
H  1.414949 4.158227 -1.121747
H  -0.983393 1.733454 2.448259
H  -0.754053 5.003761 -0.301634
H  -1.974477 3.786983 1.481001
elementType: O C H
totalener: -1117.86741297 hartree
nucrepener: 2390.79555962 hartree
electener: -3508.66297260 hartree
oneelecener: -6271.39345267 hartree
twoeener: 2762.73048007 hartree
cpcmener: -0.02455451 hartree
kineticenergy: 1112.80650338 hartree
xcener: -110.234529085808 hartree
chargesum: -0.0000000
charge: -0.295786 -0.459585 -0.328491 0.121123 -0.017886 -0.025111 -0.279675 -0.284259 -0.293794 0.327614 -0.009087 -0.226330 -0.221661 0.064731 0.034908 -0.250094 -0.215251 0.254337 -0.119765 -0.242836 0.316810 -0.196210 -0.258965 -0.145405 -0.115958 -0.199252 0.092033 0.104399 0.097263 0.099078 0.090588 0.093106 0.093958 0.098881 0.114654 0.088839 0.098328 0.091578 0.103588 0.120067 0.030318 0.127048 0.116705 0.205967 0.140336 0.157073 0.145665 0.146955 0.141406 0.159876 0.153785 0.154384
qa: -0.2958 -0.4596 -0.3285 0.1211 -0.0179 -0.0251 -0.2797 -0.2843 -0.2938 0.3276 -0.0091 -0.2263 -0.2217 0.0647 0.0349 -0.2501 -0.2153 0.2543 -0.1198 -0.2428 0.3168 -0.1962 -0.2590 -0.1454 -0.1160 -0.1993 0.0920 0.1044 0.0973 0.0991 0.0906 0.0931 0.0940 0.0989 0.1147 0.0888 0.0983 0.0916 0.1036 0.1201 0.0303 0.1270 0.1167 0.2060 0.1403 0.1571 0.1457 0.1470 0.1414 0.1599 0.1538 0.1544
va: 2.1144 2.0345 2.0842 3.7856 3.7724 3.7640 3.9004 3.8874 3.8322 4.1711 3.7404 3.9237 3.8916 3.8183 3.6086 3.9448 3.9664 3.7484 3.8835 4.0184 3.6582 3.8292 3.9730 3.8390 3.8490 3.8556 1.0224 1.0255 1.0017 1.0026 1.0050 1.0008 1.0210 0.9987 1.0082 1.0069 0.9974 0.9969 1.0018 1.0036 1.0301 0.9897 1.0088 0.9581 1.0009 0.9889 1.0058 1.0097 1.0107 0.9890 0.9904 0.9925
dispcorr: -0.031195217 hartree
energy: -1117.898608191855
dipole: -25.25399 24.54074 -0.71325 -3.16133 2.76142 -0.39991 -2.23584 1.42586 -0.80998
magnitude: 1.15096 au
magnitude: 2.92552 debye
