program: Orca
programVersion: 5.0.2
elementType: O O O C C C C C C C C C C C C C C C C C C C C C C C H H H H H H H H H H H H H H H H H H H H H H H H H H
charge: 0
multiplicity: 1
keywords: wb97x-d3
keywords: def2-TZVPP
keywords: def2/J RIJCOSX
keywords: DEFGRID2
keywords: scfconv7
keywords: smallprint printgap noloewdin
keywords: NOSOSCF
formula: C23H26O3
InChI: InChI=1/C23H26O3/c1-16(2)13-20-21(23(20,3)4)22(24)25-15-17-9-8-12-19(14-17)26-18-10-6-5-7-11-18/h5-14,20-21H,15H2,1-4H3
52 atoms
O  0.692136 -2.271789 -1.326475
O  0.186057 -2.48709 0.837695
O  3.054969 2.096005 -0.133565
C  -2.760684 -2.417379 -0.274509
C  -2.401262 -1.070296 0.275264
C  -1.475492 -1.738691 -0.71894
C  -3.842942 -2.51551 -1.321478
C  -2.723417 -3.609582 0.649102
C  -3.09969 0.170179 -0.132316
C  -0.145589 -2.204279 -0.288478
C  -3.853395 0.94218 0.655824
C  -4.476535 2.199496 0.129932
C  -4.139063 0.652215 2.096804
C  2.047661 -2.624645 -1.057756
C  2.783467 -1.552909 -0.302494
C  2.548279 -0.210972 -0.577674
C  3.730654 -1.903998 0.652625
C  3.242085 0.765371 0.1238
C  4.440591 -0.918878 1.322677
C  4.193279 0.4226 1.073161
C  1.789184 2.605671 -0.217081
C  1.602069 3.676489 -1.081463
C  0.736468 2.131255 0.557721
C  0.353726 4.27517 -1.169382
C  -0.507721 2.737077 0.453377
C  -0.708787 3.80658 -0.40841
H  -2.043952 -1.093773 1.300323
H  -1.502351 -1.340896 -1.727901
H  -4.827988 -2.539596 -0.850237
H  -3.732763 -3.433154 -1.902887
H  -3.832116 -1.67976 -2.020616
H  -3.715739 -3.76992 1.075931
H  -2.03045 -3.490239 1.47884
H  -2.450061 -4.518728 0.109021
H  -2.969966 0.477061 -1.166456
H  -4.16657 3.067733 0.718323
H  -5.567295 2.158454 0.198302
H  -4.212518 2.386421 -0.911095
H  -5.215914 0.555332 2.260135
H  -3.807366 1.477032 2.733273
H  -3.670106 -0.260216 2.460643
H  2.491845 -2.76918 -2.04341
H  2.104151 -3.578803 -0.529442
H  1.823041 0.078159 -1.329446
H  3.910139 -2.948366 0.87685
H  5.177456 -1.195296 2.065533
H  4.729812 1.195439 1.608926
H  2.430912 4.039624 -1.676492
H  0.873822 1.303602 1.242289
H  0.213582 5.110298 -1.843692
H  -1.324296 2.367138 1.059424
H  -1.682343 4.273118 -0.482531
elementType: O C H
totalener: -1117.86980562 hartree
nucrepener: 2320.15408408 hartree
electener: -3438.02388970 hartree
oneelecener: -6130.05490484 hartree
twoeener: 2692.03101514 hartree
cpcmener: -0.02531427 hartree
kineticenergy: 1112.81311195 hartree
xcener: -110.230117444751 hartree
chargesum: 0.0000000
charge: -0.293448 -0.465954 -0.332103 0.142650 0.025886 -0.105840 -0.262431 -0.290110 -0.298037 0.387300 -0.043319 -0.242302 -0.252057 0.102861 0.034976 -0.223791 -0.217677 0.252628 -0.116818 -0.241146 0.302781 -0.260981 -0.196911 -0.109389 -0.147853 -0.213479 0.098144 0.087210 0.095821 0.097445 0.089240 0.094551 0.093966 0.099655 0.121054 0.092223 0.106712 0.091958 0.102229 0.093623 0.089276 0.121078 0.114162 0.142923 0.140947 0.156655 0.145834 0.144776 0.149073 0.156985 0.182880 0.156146
qa: -0.2934 -0.4660 -0.3321 0.1426 0.0259 -0.1058 -0.2624 -0.2901 -0.2980 0.3873 -0.0433 -0.2423 -0.2521 0.1029 0.0350 -0.2238 -0.2177 0.2526 -0.1168 -0.2411 0.3028 -0.2610 -0.1969 -0.1094 -0.1479 -0.2135 0.0981 0.0872 0.0958 0.0974 0.0892 0.0946 0.0940 0.0997 0.1211 0.0922 0.1067 0.0920 0.1022 0.0936 0.0893 0.1211 0.1142 0.1429 0.1409 0.1567 0.1458 0.1448 0.1491 0.1570 0.1829 0.1561
va: 2.1146 2.0363 2.0751 3.7164 3.7266 3.8749 3.9061 3.9017 3.8318 4.1586 3.7023 3.9159 3.9424 3.7974 3.6104 3.9363 3.9675 3.7366 3.8930 4.0181 3.6806 4.0141 3.9002 3.8944 3.8515 3.9234 1.0257 1.0403 1.0029 1.0031 1.0036 1.0008 1.0192 0.9995 1.0086 0.9935 0.9990 1.0071 0.9970 0.9980 1.0090 0.9918 1.0095 1.0163 1.0030 0.9893 1.0056 1.0087 1.0074 0.9889 0.9643 0.9932
dispcorr: -0.027203331 hartree
energy: -1117.897008947695
dipole: -30.73368 29.84610 -0.88758 -3.68121 3.51291 -0.16829 2.66275 -3.29464 -0.63189
magnitude: 1.10245 au
magnitude: 2.80221 debye
