program: Orca
programVersion: 5.0.2
elementType: O O O C C C C C C C C C C C C C C C C C C C C C C C H H H H H H H H H H H H H H H H H H H H H H H H H H
charge: 0
multiplicity: 1
keywords: wb97x-d3
keywords: def2-TZVPP
keywords: def2/J RIJCOSX
keywords: DEFGRID2
keywords: scfconv7
keywords: smallprint printgap noloewdin
keywords: NOSOSCF
formula: C23H26O3
InChI: InChI=1/C23H26O3/c1-16(2)13-20-21(23(20,3)4)22(24)25-15-17-9-8-12-19(14-17)26-18-10-6-5-7-11-18/h5-14,20-21H,15H2,1-4H3
52 atoms
O  0.371186 -2.639379 0.36103
O  -0.474213 -0.70106 1.083622
O  3.57288 2.236949 -0.243777
C  -3.193759 -2.260551 0.912267
C  -3.034029 -1.42993 -0.324207
C  -1.908828 -2.355565 0.11018
C  -4.076365 -3.485371 0.878295
C  -3.216917 -1.559772 2.248702
C  -3.742109 -1.724059 -1.585538
C  -0.632037 -1.785552 0.574791
C  -4.360152 -0.844357 -2.380648
C  -5.018004 -1.294075 -3.651319
C  -4.460372 0.627264 -2.117394
C  1.695651 -2.204734 0.681281
C  2.181636 -1.153454 -0.275843
C  2.644615 0.061187 0.207969
C  2.168204 -1.390801 -1.648441
C  3.080875 1.03792 -0.678677
C  2.614993 -0.412782 -2.522331
C  3.067011 0.810168 -2.045574
C  2.948555 2.905981 0.772407
C  1.56681 2.910838 0.927897
C  3.758485 3.639096 1.62896
C  1.004662 3.649474 1.959151
C  3.180454 4.381447 2.64854
C  1.803344 4.387366 2.822345
H  -2.838633 -0.381673 -0.125185
H  -1.803715 -3.268142 -0.466111
H  -3.982524 -4.052882 -0.04665
H  -5.125813 -3.204873 0.990921
H  -3.824216 -4.158195 1.700325
H  -2.766556 -2.180149 3.026595
H  -4.252011 -1.371189 2.541116
H  -2.702842 -0.601431 2.242555
H  -3.743031 -2.764867 -1.89643
H  -4.901768 -2.364651 -3.820882
H  -4.600609 -0.770213 -4.515723
H  -6.087975 -1.069079 -3.643416
H  -3.940272 1.193211 -2.89393
H  -4.053152 0.932671 -1.156261
H  -5.50359 0.950036 -2.149882
H  2.302083 -3.10719 0.604228
H  1.750681 -1.854352 1.713768
H  2.654023 0.243901 1.276018
H  1.810782 -2.336582 -2.03688
H  2.604907 -0.59587 -3.588984
H  3.406354 1.57978 -2.72738
H  0.927527 2.346466 0.260487
H  4.833083 3.627831 1.495139
H  -0.070936 3.649082 2.08083
H  3.815124 4.951919 3.314519
H  1.356153 4.961983 3.622715
elementType: O C H
totalener: -1117.87045840 hartree
nucrepener: 2228.17649223 hartree
electener: -3346.04695063 hartree
oneelecener: -5946.37386690 hartree
twoeener: 2600.32691626 hartree
cpcmener: -0.02514258 hartree
kineticenergy: 1112.81505747 hartree
xcener: -110.228938844246 hartree
chargesum: -0.0000000
charge: -0.288209 -0.473311 -0.331307 0.105963 0.041237 -0.095192 -0.269671 -0.276939 -0.276595 0.397656 -0.048616 -0.217036 -0.252808 0.095866 0.026836 -0.198307 -0.250078 0.269763 -0.112578 -0.246394 0.287297 -0.187148 -0.252403 -0.145993 -0.120518 -0.189846 0.093374 0.085521 0.086994 0.097244 0.096927 0.098261 0.094407 0.092427 0.114993 0.087497 0.092208 0.093040 0.097707 0.090217 0.093458 0.124969 0.112713 0.142446 0.140695 0.157212 0.146607 0.151354 0.145214 0.159205 0.156322 0.157322
qa: -0.2882 -0.4733 -0.3313 0.1060 0.0412 -0.0952 -0.2697 -0.2769 -0.2766 0.3977 -0.0486 -0.2170 -0.2528 0.0959 0.0268 -0.1983 -0.2501 0.2698 -0.1126 -0.2464 0.2873 -0.1871 -0.2524 -0.1460 -0.1205 -0.1898 0.0934 0.0855 0.0870 0.0972 0.0969 0.0983 0.0944 0.0924 0.1150 0.0875 0.0922 0.0930 0.0977 0.0902 0.0935 0.1250 0.1127 0.1424 0.1407 0.1572 0.1466 0.1514 0.1452 0.1592 0.1563 0.1573
va: 2.1176 2.0313 2.0754 3.6883 3.7693 3.8292 3.9117 3.9037 3.8807 4.1638 3.7643 3.9215 3.9418 3.8011 3.6154 3.9180 3.9673 3.7269 3.8871 4.0197 3.6978 3.8935 4.0049 3.8969 3.8861 3.9076 1.0301 1.0377 1.0062 1.0017 1.0018 0.9992 1.0001 1.0203 1.0122 1.0091 0.9959 0.9966 0.9963 1.0100 0.9977 0.9913 1.0105 1.0084 1.0100 0.9890 1.0060 1.0042 1.0086 0.9905 0.9894 0.9907
dispcorr: -0.023420614 hartree
energy: -1117.893879015728
dipole: -32.35332 31.62474 -0.72858 -9.25754 8.32633 -0.93121 -4.24785 4.01821 -0.22964
magnitude: 1.20446 au
magnitude: 3.06148 debye
