program: Orca
programVersion: 5.0.2
elementType: O O O C C C C C C C C C C C C C C C C C C C C C C C H H H H H H H H H H H H H H H H H H H H H H H H H H
charge: 0
multiplicity: 1
keywords: wb97x-d3
keywords: def2-TZVPP
keywords: def2/J RIJCOSX
keywords: DEFGRID2
keywords: scfconv7
keywords: smallprint printgap noloewdin
keywords: NOSOSCF
formula: C23H26O3
InChI: InChI=1/C23H26O3/c1-16(2)13-20-21(23(20,3)4)22(24)25-15-17-9-8-12-19(14-17)26-18-10-6-5-7-11-18/h5-14,20-21H,15H2,1-4H3
52 atoms
O  0.293831 -2.51655 0.47724
O  -0.677003 -0.605232 1.106894
O  3.367248 2.441664 -0.527398
C  -3.30762 -2.327058 0.998881
C  -3.164708 -1.568985 -0.284194
C  -2.000734 -2.404387 0.233096
C  -4.119131 -3.601002 1.03057
C  -3.403984 -1.543467 2.284886
C  -3.823229 -1.970223 -1.541007
C  -0.765317 -1.724428 0.660528
C  -4.313099 -1.158492 -2.484648
C  -4.932085 -1.723363 -3.728411
C  -4.292404 0.338767 -2.430851
C  1.587545 -1.969598 0.737596
C  1.986509 -0.953821 -0.296666
C  2.467851 0.285543 0.104567
C  1.894042 -1.257465 -1.652015
C  2.853956 1.219312 -0.850199
C  2.284231 -0.31849 -2.594385
C  2.76051 0.923407 -2.20314
C  3.040677 3.032501 0.665343
C  1.715752 3.228036 1.036391
C  4.077845 3.484955 1.466368
C  1.437381 3.87963 2.228339
C  3.78481 4.146841 2.651181
C  2.466883 4.341269 3.039081
H  -3.023018 -0.502658 -0.144822
H  -1.832431 -3.345365 -0.278873
H  -3.854204 -4.196789 1.906366
H  -3.965135 -4.229028 0.154077
H  -5.185745 -3.376039 1.095392
H  -4.455024 -1.37821 2.53087
H  -2.926154 -0.568034 2.232723
H  -2.957684 -2.09471 3.115489
H  -3.894805 -3.03934 -1.718726
H  -5.975423 -1.411228 -3.826568
H  -4.904852 -2.812927 -3.74609
H  -4.417555 -1.360208 -4.622411
H  -3.645441 0.741822 -3.21421
H  -3.95049 0.745208 -1.481627
H  -5.289562 0.742491 -2.621459
H  2.256181 -2.830065 0.704839
H  1.638403 -1.549567 1.74406
H  2.535732 0.511718 1.161843
H  1.521448 -2.221854 -1.97425
H  2.213395 -0.550874 -3.649151
H  3.060361 1.658975 -2.938966
H  0.908739 2.878917 0.403707
H  5.104652 3.323907 1.162218
H  0.406377 4.033149 2.520038
H  4.594022 4.501563 3.276437
H  2.241825 4.851778 3.966263
elementType: O C H
totalener: -1117.87029755 hartree
nucrepener: 2218.17867962 hartree
electener: -3336.04897717 hartree
oneelecener: -5926.40775024 hartree
twoeener: 2590.35877307 hartree
cpcmener: -0.02541588 hartree
kineticenergy: 1112.80635408 hartree
xcener: -110.227231071157 hartree
chargesum: 0.0000000
charge: -0.289605 -0.471488 -0.329845 0.101759 0.037513 -0.082066 -0.275067 -0.273390 -0.274935 0.392324 -0.048552 -0.216217 -0.254753 0.096401 0.013705 -0.190409 -0.258320 0.280603 -0.110514 -0.253526 0.263307 -0.184811 -0.230006 -0.144632 -0.132076 -0.175451 0.093641 0.085739 0.096415 0.088921 0.097966 0.094586 0.091305 0.097222 0.114621 0.093339 0.086907 0.092054 0.098856 0.090321 0.093516 0.123115 0.112144 0.137867 0.139798 0.156551 0.145321 0.157325 0.146175 0.159480 0.158303 0.158561
qa: -0.2896 -0.4715 -0.3298 0.1018 0.0375 -0.0821 -0.2751 -0.2734 -0.2749 0.3923 -0.0486 -0.2162 -0.2548 0.0964 0.0137 -0.1904 -0.2583 0.2806 -0.1105 -0.2535 0.2633 -0.1848 -0.2300 -0.1446 -0.1321 -0.1755 0.0936 0.0857 0.0964 0.0889 0.0980 0.0946 0.0913 0.0972 0.1146 0.0933 0.0869 0.0921 0.0989 0.0903 0.0935 0.1231 0.1121 0.1379 0.1398 0.1566 0.1453 0.1573 0.1462 0.1595 0.1583 0.1586
va: 2.1152 2.0362 2.0755 3.7012 3.7724 3.8072 3.9132 3.9011 3.8894 4.1698 3.7672 3.9202 3.9403 3.8046 3.6575 3.8976 3.9682 3.7288 3.8970 4.0074 3.7067 3.9276 4.0080 3.8912 3.8862 3.8982 1.0300 1.0363 1.0015 1.0066 1.0012 0.9997 1.0210 0.9995 1.0127 0.9964 1.0093 0.9960 0.9960 1.0105 0.9974 0.9909 1.0114 1.0112 1.0110 0.9890 1.0075 0.9984 1.0069 0.9902 0.9893 0.9902
dispcorr: -0.023156525 hartree
energy: -1117.893454071278
dipole: -31.13878 30.62417 -0.51461 -11.18851 10.31655 -0.87197 -4.06778 4.04506 -0.02272
magnitude: 1.01275 au
magnitude: 2.57420 debye
