program: Orca
programVersion: 5.0.2
elementType: O O O C C C C C C C C C C C C C C C C C C C C C C C H H H H H H H H H H H H H H H H H H H H H H H H H H
charge: 0
multiplicity: 1
keywords: wb97x-d3
keywords: def2-TZVPP
keywords: def2/J RIJCOSX
keywords: DEFGRID2
keywords: scfconv7
keywords: smallprint printgap noloewdin
keywords: NOSOSCF
formula: C23H26O3
InChI: InChI=1/C23H26O3/c1-16(2)13-20-21(23(20,3)4)22(24)25-15-17-9-8-12-19(14-17)26-18-10-6-5-7-11-18/h5-14,20-21H,15H2,1-4H3
52 atoms
O  0.101969 -2.407192 1.335115
O  -0.364732 -2.652874 -0.834676
O  1.750145 2.157485 0.207122
C  -2.687163 -0.689586 0.161682
C  -3.215228 -2.01853 -0.299998
C  -2.084602 -1.982443 0.693015
C  -3.502416 0.112613 1.145368
C  -1.924675 0.168288 -0.81793
C  -4.542088 -2.524298 0.125511
C  -0.725378 -2.388875 0.286514
C  -5.627976 -2.598799 -0.649422
C  -6.921181 -3.141955 -0.12151
C  -5.66762 -2.157965 -2.080437
C  1.488365 -2.610628 1.067639
C  2.097592 -1.447978 0.332734
C  1.696137 -0.14778 0.619653
C  3.085544 -1.664286 -0.619512
C  2.256925 0.917998 -0.066825
C  3.654295 -0.587853 -1.285722
C  3.239619 0.70907 -1.027575
C  2.572612 3.249687 0.239052
C  2.069362 4.433847 -0.281031
C  3.835452 3.209457 0.818297
C  2.838705 5.586998 -0.221376
C  4.597963 4.367537 0.859364
C  4.10725 5.558582 0.34124
H  -2.9148 -2.285952 -1.308526
H  -2.327405 -2.201856 1.727887
H  -4.274459 0.683711 0.624786
H  -2.870589 0.82471 1.67994
H  -3.999051 -0.510232 1.888812
H  -1.204962 0.810972 -0.305687
H  -2.619313 0.820549 -1.351581
H  -1.384605 -0.408141 -1.566902
H  -4.627343 -2.856766 1.156452
H  -7.255132 -4.003098 -0.706734
H  -7.717483 -2.395723 -0.190239
H  -6.843156 -3.454716 0.919942
H  -5.919233 -2.993477 -2.738995
H  -4.731207 -1.726949 -2.430159
H  -6.449015 -1.407493 -2.226216
H  1.648977 -3.542035 0.520598
H  1.944602 -2.72506 2.051644
H  0.936771 0.050131 1.366918
H  3.402539 -2.673485 -0.85206
H  4.416422 -0.760009 -2.034657
H  3.670285 1.537474 -1.575475
H  1.081014 4.45027 -0.723408
H  4.223827 2.289677 1.237454
H  2.443521 6.510024 -0.625499
H  5.582604 4.335617 1.307728
H  4.707894 6.457642 0.37933
elementType: O C H
totalener: -1117.86974704 hartree
nucrepener: 2214.01747254 hartree
electener: -3331.88721959 hartree
oneelecener: -5917.90298053 hartree
twoeener: 2586.01576094 hartree
cpcmener: -0.02591535 hartree
kineticenergy: 1112.80763912 hartree
xcener: -110.227976078116 hartree
chargesum: 0.0000000
charge: -0.289146 -0.453342 -0.332656 0.157435 -0.003699 -0.117592 -0.267585 -0.291655 -0.272866 0.372828 -0.029057 -0.228568 -0.250850 0.097063 0.069291 -0.331881 -0.223965 0.312874 -0.121368 -0.212757 0.269479 -0.243427 -0.183806 -0.127780 -0.152612 -0.178350 0.094733 0.092677 0.095987 0.098029 0.090108 0.089008 0.102493 0.095747 0.118780 0.094112 0.093425 0.088334 0.097291 0.088232 0.093943 0.115471 0.120875 0.134595 0.140626 0.158061 0.156964 0.146354 0.155484 0.156639 0.158444 0.157579
qa: -0.2891 -0.4533 -0.3327 0.1574 -0.0037 -0.1176 -0.2676 -0.2917 -0.2729 0.3728 -0.0291 -0.2286 -0.2508 0.0971 0.0693 -0.3319 -0.2240 0.3129 -0.1214 -0.2128 0.2695 -0.2434 -0.1838 -0.1278 -0.1526 -0.1784 0.0947 0.0927 0.0960 0.0980 0.0901 0.0890 0.1025 0.0957 0.1188 0.0941 0.0934 0.0883 0.0973 0.0882 0.0939 0.1155 0.1209 0.1346 0.1406 0.1581 0.1570 0.1464 0.1555 0.1566 0.1584 0.1576
va: 2.1106 2.0521 2.0496 3.6644 3.7965 3.8628 3.9015 3.8936 3.8738 4.2274 3.7100 3.9266 3.9430 3.7943 3.5840 4.0314 3.9879 3.6717 3.8963 3.9471 3.7116 4.0012 3.9035 3.8923 3.8994 3.8974 1.0289 1.0367 1.0031 1.0035 1.0026 1.0067 1.0031 1.0159 1.0082 0.9952 0.9964 1.0081 0.9976 1.0086 0.9977 1.0091 0.9927 1.0272 1.0034 0.9902 0.9957 1.0073 0.9979 0.9899 0.9906 0.9904
dispcorr: -0.024746980 hartree
energy: -1117.894494021902
dipole: -29.14798 29.31154 0.16356 -4.94126 5.40138 0.46012 -3.40054 3.99409 0.59355
magnitude: 0.76861 au
magnitude: 1.95365 debye
