program: Orca
programVersion: 5.0.2
elementType: O O O C C C C C C C C C C C C C C C C C C C C C C C H H H H H H H H H H H H H H H H H H H H H H H H H H
charge: 0
multiplicity: 1
keywords: wb97x-d3
keywords: def2-TZVPP
keywords: def2/J RIJCOSX
keywords: DEFGRID2
keywords: scfconv7
keywords: smallprint printgap noloewdin
keywords: NOSOSCF
formula: C23H26O3
InChI: InChI=1/C23H26O3/c1-16(2)13-20-21(23(20,3)4)22(24)25-15-17-9-8-12-19(14-17)26-18-10-6-5-7-11-18/h5-14,20-21H,15H2,1-4H3
52 atoms
O  0.66723 -2.245274 -1.337184
O  0.162115 -2.494401 0.823688
O  3.062334 2.106749 -0.090977
C  -2.779857 -2.482093 -0.310264
C  -2.460961 -1.139984 0.276646
C  -1.510729 -1.759637 -0.7281
C  -3.849697 -2.590948 -1.368989
C  -2.714518 -3.693258 0.587402
C  -3.18041 0.094878 -0.103399
C  -0.172547 -2.204102 -0.299599
C  -3.818271 0.925701 0.726766
C  -4.463481 2.177556 0.212286
C  -3.93481 0.72311 2.20675
C  2.024006 -2.596888 -1.074148
C  2.755277 -1.538333 -0.295949
C  2.5349 -0.19203 -0.56265
C  3.683604 -1.906553 0.670956
C  3.226113 0.77174 0.158436
C  4.389751 -0.933851 1.362922
C  4.157751 0.4115 1.121231
C  1.808272 2.635748 -0.219415
C  1.67313 3.717096 -1.080727
C  0.718536 2.172747 0.509684
C  0.440585 4.339974 -1.209802
C  -0.509665 2.802133 0.363544
C  -0.657929 3.883895 -0.493483
H  -2.107813 -1.182216 1.302021
H  -1.539267 -1.339558 -1.727891
H  -3.849795 -1.748695 -2.059962
H  -4.838762 -2.642625 -0.908813
H  -3.712648 -3.499714 -1.958485
H  -2.415122 -4.582326 0.028149
H  -3.703208 -3.889225 1.007375
H  -2.026961 -3.57381 1.421553
H  -3.166634 0.349186 -1.15955
H  -4.299668 2.317802 -0.85628
H  -4.077226 3.059599 0.730987
H  -5.542497 2.167638 0.389635
H  -3.597473 -0.255652 2.543316
H  -4.973107 0.84009 2.527412
H  -3.360316 1.479564 2.749446
H  2.469699 -2.719615 -2.061919
H  2.083432 -3.561101 -0.564882
H  1.825091 0.108733 -1.324508
H  3.850697 -2.954685 0.886998
H  5.111546 -1.223559 2.115482
H  4.690867 1.175848 1.672469
H  2.531287 4.068745 -1.640139
H  0.816529 1.336504 1.190619
H  0.341165 5.183668 -1.880737
H  -1.35586 2.44237 0.9345
H  -1.620318 4.367581 -0.598142
elementType: O C H
totalener: -1117.87013376 hartree
nucrepener: 2315.09576575 hartree
electener: -3432.96589951 hartree
oneelecener: -6119.90476349 hartree
twoeener: 2686.93886399 hartree
cpcmener: -0.02556233 hartree
kineticenergy: 1112.80748562 hartree
xcener: -110.229041079471 hartree
chargesum: -0.0000000
charge: -0.292974 -0.466425 -0.331693 0.119291 0.058195 -0.103348 -0.262293 -0.283929 -0.305936 0.387741 -0.047282 -0.234147 -0.256282 0.102581 0.035875 -0.227621 -0.217277 0.256453 -0.116274 -0.243370 0.306663 -0.262647 -0.206093 -0.105003 -0.137604 -0.220871 0.095412 0.086822 0.087966 0.096558 0.097136 0.099043 0.095041 0.093438 0.118499 0.091892 0.089340 0.105939 0.090830 0.099934 0.095339 0.121164 0.114060 0.142840 0.140840 0.156513 0.145742 0.144712 0.148701 0.156852 0.185367 0.154287
qa: -0.2930 -0.4664 -0.3317 0.1193 0.0582 -0.1033 -0.2623 -0.2839 -0.3059 0.3877 -0.0473 -0.2341 -0.2563 0.1026 0.0359 -0.2276 -0.2173 0.2565 -0.1163 -0.2434 0.3067 -0.2626 -0.2061 -0.1050 -0.1376 -0.2209 0.0954 0.0868 0.0880 0.0966 0.0971 0.0990 0.0950 0.0934 0.1185 0.0919 0.0893 0.1059 0.0908 0.0999 0.0953 0.1212 0.1141 0.1428 0.1408 0.1565 0.1457 0.1447 0.1487 0.1569 0.1854 0.1543
va: 2.1145 2.0362 2.0760 3.7229 3.7146 3.8579 3.9062 3.9039 3.8445 4.1577 3.7217 3.9152 3.9406 3.7979 3.6111 3.9371 3.9660 3.7342 3.8940 4.0176 3.6794 4.0144 3.9144 3.8891 3.8410 3.9336 1.0283 1.0399 1.0049 1.0025 1.0028 0.9995 1.0006 1.0195 1.0103 1.0077 0.9934 0.9988 1.0076 0.9976 0.9966 0.9918 1.0094 1.0161 1.0031 0.9894 1.0059 1.0089 1.0081 0.9889 0.9615 0.9947
dispcorr: -0.026824349 hartree
energy: -1117.896958103795
dipole: -30.24936 29.40001 -0.84935 -3.84275 3.68626 -0.15649 2.68265 -3.34012 -0.65747
magnitude: 1.08543 au
magnitude: 2.75893 debye
