program: Orca
programVersion: 5.0.2
elementType: O O O C C C C C C C C C C C C C C C C C C C C C C C H H H H H H H H H H H H H H H H H H H H H H H H H H
charge: 0
multiplicity: 1
keywords: wb97x-d3
keywords: def2-TZVPP
keywords: def2/J RIJCOSX
keywords: DEFGRID2
keywords: scfconv7
keywords: smallprint printgap noloewdin
keywords: NOSOSCF
formula: C23H26O3
InChI: InChI=1/C23H26O3/c1-16(2)13-20-21(23(20,3)4)22(24)25-15-17-9-8-12-19(14-17)26-18-10-6-5-7-11-18/h5-14,20-21H,15H2,1-4H3
52 atoms
O  0.251214 -1.806933 -1.294218
O  -0.008154 -3.10748 0.504833
O  3.184179 2.352029 0.361684
C  -3.018084 -3.059769 -0.385512
C  -2.805845 -2.104193 0.740028
C  -1.903461 -2.025512 -0.473642
C  -4.176305 -2.830263 -1.326796
C  -2.701885 -4.521553 -0.185585
C  -3.771695 -1.01434 1.034797
C  -0.481188 -2.388351 -0.343792
C  -3.474035 0.273295 1.228052
C  -4.54469 1.281701 1.514429
C  -2.085046 0.83181 1.164126
C  1.669403 -2.024339 -1.277608
C  2.348025 -1.173419 -0.241725
C  2.419299 0.203731 -0.43546
C  2.903148 -1.739401 0.899711
C  3.035141 1.003403 0.517559
C  3.529377 -0.931645 1.838218
C  3.592221 0.440811 1.658343
C  2.209464 3.096423 -0.245041
C  2.624984 4.0853 -1.124662
C  0.860519 2.926674 0.044657
C  1.681403 4.912713 -1.718094
C  -0.071983 3.754035 -0.564199
C  0.330544 4.746993 -1.447785
H  -2.327625 -2.54601 1.612132
H  -2.099366 -1.208647 -1.159107
H  -4.379606 -1.771909 -1.493391
H  -5.087466 -3.286395 -0.933531
H  -3.975587 -3.284933 -2.299149
H  -1.939549 -4.698844 0.569557
H  -2.368259 -4.983914 -1.116913
H  -3.603558 -5.048487 0.134452
H  -4.813229 -1.315059 1.117972
H  -4.379864 1.768125 2.479343
H  -5.539793 0.836958 1.526675
H  -4.54081 2.077594 0.764366
H  -1.311209 0.068431 1.115017
H  -1.883241 1.452834 2.040943
H  -1.972292 1.482682 0.292132
H  1.997636 -1.745576 -2.27847
H  1.897567 -3.081576 -1.133506
H  2.005701 0.641255 -1.336897
H  2.853686 -2.809625 1.054153
H  3.964227 -1.371747 2.726155
H  4.074031 1.073704 2.393064
H  3.678883 4.208172 -1.340621
H  0.532985 2.165561 0.741888
H  2.008435 5.684358 -2.403088
H  -1.12238 3.623165 -0.336683
H  -0.402509 5.39033 -1.916727
elementType: O C H
totalener: -1117.86839835 hartree
nucrepener: 2283.60663151 hartree
electener: -3401.47502985 hartree
oneelecener: -6056.61071082 hartree
twoeener: 2655.13568097 hartree
cpcmener: -0.02395521 hartree
kineticenergy: 1112.80230100 hartree
xcener: -110.225901560862 hartree
chargesum: 0.0000000
charge: -0.285136 -0.475737 -0.330407 0.135311 0.001458 -0.118572 -0.281445 -0.284656 -0.295391 0.389754 -0.004917 -0.231207 -0.260851 0.082723 0.009230 -0.230346 -0.185215 0.272793 -0.126987 -0.244619 0.274329 -0.241325 -0.200658 -0.122535 -0.139874 -0.191046 0.100927 0.098451 0.091706 0.097584 0.098207 0.092716 0.098695 0.094023 0.119476 0.096974 0.089146 0.092811 0.090884 0.109439 0.098559 0.125927 0.113534 0.140663 0.139245 0.156227 0.146781 0.144970 0.174157 0.157012 0.159437 0.157774
qa: -0.2851 -0.4757 -0.3304 0.1353 0.0015 -0.1186 -0.2814 -0.2847 -0.2954 0.3898 -0.0049 -0.2312 -0.2609 0.0827 0.0092 -0.2303 -0.1852 0.2728 -0.1270 -0.2446 0.2743 -0.2413 -0.2007 -0.1225 -0.1399 -0.1910 0.1009 0.0985 0.0917 0.0976 0.0982 0.0927 0.0987 0.0940 0.1195 0.0970 0.0891 0.0928 0.0909 0.1094 0.0986 0.1259 0.1135 0.1407 0.1392 0.1562 0.1468 0.1450 0.1742 0.1570 0.1594 0.1578
va: 2.1155 2.0301 2.0775 3.7030 3.7864 3.8117 3.9051 3.8986 3.8948 4.1721 3.7485 3.9288 3.9218 3.8090 3.6176 3.9434 3.9327 3.7196 3.9194 4.0086 3.7594 4.0040 3.9191 3.8863 3.8905 3.9332 1.0263 1.0273 1.0036 1.0010 1.0027 1.0198 0.9986 1.0010 1.0042 0.9967 1.0066 0.9971 1.0050 0.9966 0.9991 0.9942 1.0100 1.0110 1.0140 0.9900 1.0063 1.0080 0.9804 0.9889 0.9918 0.9913
dispcorr: -0.026185505 hartree
energy: -1117.894583851411
dipole: -27.17673 26.41611 -0.76062 -6.11217 6.67104 0.55887 0.45363 -1.27748 -0.82385
magnitude: 1.25284 au
magnitude: 3.18447 debye
