program: Orca
programVersion: 5.0.2
elementType: O O O C C C C C C C C C C C C C C C C C C C C C C C H H H H H H H H H H H H H H H H H H H H H H H H H H
charge: 0
multiplicity: 1
keywords: wb97x-d3
keywords: def2-TZVPP
keywords: def2/J RIJCOSX
keywords: DEFGRID2
keywords: scfconv7
keywords: smallprint printgap noloewdin
keywords: NOSOSCF
formula: C23H26O3
InChI: InChI=1/C23H26O3/c1-16(2)13-20-21(23(20,3)4)22(24)25-15-17-9-8-12-19(14-17)26-18-10-6-5-7-11-18/h5-14,20-21H,15H2,1-4H3
52 atoms
O  0.650275 -2.17788 -1.391385
O  0.126758 -2.567673 0.74333
O  3.049574 2.121326 0.112922
C  -2.811544 -2.529461 -0.385857
C  -2.50232 -1.209413 0.250267
C  -1.547109 -1.784147 -0.7804
C  -3.879783 -2.611863 -1.4493
C  -2.741775 -3.770674 0.469536
C  -3.223977 0.037897 -0.074954
C  -0.202449 -2.220455 -0.365812
C  -3.757185 0.893153 0.803668
C  -4.406578 2.162288 0.340783
C  -3.734987 0.707701 2.291291
C  2.012111 -2.523005 -1.134713
C  2.7163 -1.509052 -0.276669
C  2.518899 -0.149527 -0.493698
C  3.59657 -1.928865 0.713422
C  3.182037 0.775009 0.301683
C  4.278361 -0.994171 1.478816
C  4.067458 0.362111 1.287633
C  1.830314 2.679095 -0.149576
C  0.647653 2.20784 0.409163
C  1.825681 3.800699 -0.968035
C  -0.540911 2.867947 0.130103
C  0.630987 4.455471 -1.228384
C  -0.559065 3.98979 -0.686885
H  -2.143483 -1.288537 1.27122
H  -1.586422 -1.326483 -1.762963
H  -3.891162 -1.746025 -2.110544
H  -4.868305 -2.693169 -0.991898
H  -3.730441 -3.496932 -2.070924
H  -2.048548 -3.681416 1.302789
H  -2.44863 -4.640812 -0.12168
H  -3.728534 -3.97815 0.88893
H  -3.29902 0.28668 -1.129745
H  -3.951542 3.032311 0.82331
H  -5.466972 2.186047 0.606835
H  -4.326804 2.298471 -0.737975
H  -3.022977 1.395952 2.75538
H  -3.473248 -0.301376 2.603786
H  -4.711625 0.940393 2.721538
H  2.469491 -2.570341 -2.123731
H  2.081772 -3.519317 -0.692385
H  1.850541 0.188794 -1.276784
H  3.746633 -2.986729 0.890379
H  4.963969 -1.322804 2.248983
H  4.582539 1.094304 1.896577
H  0.638967 1.34091 1.057874
H  2.754194 4.16077 -1.393237
H  -1.461456 2.4977 0.562321
H  0.634648 5.330344 -1.865752
H  -1.491988 4.496572 -0.89611
elementType: O C H
totalener: -1117.87001593 hartree
nucrepener: 2311.02745838 hartree
electener: -3428.89747431 hartree
oneelecener: -6111.69125995 hartree
twoeener: 2682.79378564 hartree
cpcmener: -0.02540932 hartree
kineticenergy: 1112.80916421 hartree
xcener: -110.229881122997 hartree
chargesum: -0.0000000
charge: -0.292873 -0.468840 -0.330099 0.106340 0.073356 -0.102794 -0.264180 -0.280233 -0.320237 0.390578 -0.027883 -0.232810 -0.264809 0.103151 0.039778 -0.247054 -0.221553 0.280673 -0.111267 -0.255723 0.322579 -0.243046 -0.268164 -0.088812 -0.090734 -0.250641 0.093245 0.086473 0.087601 0.096846 0.097106 0.093228 0.098199 0.095010 0.117112 0.088884 0.105866 0.091590 0.098160 0.093518 0.098089 0.121604 0.113959 0.142590 0.140579 0.156607 0.145819 0.149724 0.143678 0.180209 0.156536 0.153061
qa: -0.2929 -0.4688 -0.3301 0.1063 0.0734 -0.1028 -0.2642 -0.2802 -0.3202 0.3906 -0.0279 -0.2328 -0.2648 0.1032 0.0398 -0.2471 -0.2216 0.2807 -0.1113 -0.2557 0.3226 -0.2430 -0.2682 -0.0888 -0.0907 -0.2506 0.0932 0.0865 0.0876 0.0968 0.0971 0.0932 0.0982 0.0950 0.1171 0.0889 0.1059 0.0916 0.0982 0.0935 0.0981 0.1216 0.1140 0.1426 0.1406 0.1566 0.1458 0.1497 0.1437 0.1802 0.1565 0.1531
va: 2.1151 2.0341 2.0813 3.7259 3.7089 3.8528 3.9082 3.9030 3.8681 4.1566 3.7309 3.9146 3.9438 3.7980 3.6142 3.9400 3.9679 3.7181 3.8920 4.0192 3.6752 3.9535 4.0188 3.7925 3.8729 3.9631 1.0308 1.0393 1.0053 1.0021 1.0025 1.0201 0.9998 1.0003 1.0113 0.9926 0.9979 1.0076 0.9942 1.0066 0.9977 0.9917 1.0090 1.0160 1.0036 0.9893 1.0065 1.0085 1.0094 0.9627 0.9891 0.9965
dispcorr: -0.026540617 hartree
energy: -1117.896556547650
dipole: -29.74404 28.92078 -0.82326 -3.95145 3.88658 -0.06487 2.31703 -3.04005 -0.72302
magnitude: 1.09760 au
magnitude: 2.78988 debye
