program: Orca
programVersion: 5.0.2
elementType: O O O C C C C C C C C C C C C C C C C C C C C C C C H H H H H H H H H H H H H H H H H H H H H H H H H H
charge: 0
multiplicity: 1
keywords: wb97x-d3
keywords: def2-TZVPP
keywords: def2/J RIJCOSX
keywords: DEFGRID2
keywords: scfconv7
keywords: smallprint printgap noloewdin
keywords: NOSOSCF
formula: C23H26O3
InChI: InChI=1/C23H26O3/c1-16(2)13-20-21(23(20,3)4)22(24)25-15-17-9-8-12-19(14-17)26-18-10-6-5-7-11-18/h5-14,20-21H,15H2,1-4H3
52 atoms
O  0.153241 -2.88066 -0.624647
O  -0.420747 -1.773969 1.228932
O  3.542641 1.831185 0.544075
C  -3.107958 -3.377449 0.950273
C  -3.277817 -2.0331 0.334594
C  -2.091302 -2.8954 -0.073024
C  -3.983725 -4.515979 0.483943
C  -2.744284 -3.474803 2.411647
C  -4.340668 -1.727049 -0.656843
C  -0.733447 -2.452528 0.278979
C  -4.237205 -0.810079 -1.623088
C  -5.364474 -0.545104 -2.573603
C  -3.007734 0.015739 -1.846311
C  1.499854 -2.430798 -0.487298
C  1.645676 -0.961867 -0.773302
C  2.476221 -0.190434 0.027376
C  0.978114 -0.367741 -1.840897
C  2.655672 1.158201 -0.246837
C  1.152347 0.98436 -2.095177
C  1.993177 1.759249 -1.308895
C  3.298422 3.124505 0.916503
C  4.378735 3.995732 0.92339
C  2.043241 3.54826 1.336644
C  4.200046 5.302682 1.35402
C  1.877553 4.860873 1.75471
C  2.949798 5.74333 1.764893
H  -2.999677 -1.206569 0.984443
H  -2.166733 -3.369358 -1.045018
H  -3.5023 -5.474652 0.687133
H  -4.19508 -4.476465 -0.58476
H  -4.939065 -4.51059 1.013115
H  -3.654531 -3.575458 3.006675
H  -2.211053 -2.60201 2.781083
H  -2.127844 -4.354797 2.606962
H  -5.270963 -2.28128 -0.567064
H  -5.047929 -0.699101 -3.608789
H  -5.701102 0.492813 -2.506549
H  -6.223183 -1.189723 -2.385439
H  -3.248917 1.081749 -1.819681
H  -2.588489 -0.177149 -2.837752
H  -2.225283 -0.164067 -1.110974
H  2.058917 -3.017154 -1.217424
H  1.893372 -2.676734 0.50127
H  2.990016 -0.635238 0.87181
H  0.325274 -0.951815 -2.477391
H  0.633242 1.444976 -2.925819
H  2.129123 2.81033 -1.530083
H  5.352066 3.649827 0.598087
H  1.201635 2.866656 1.343782
H  5.044926 5.979379 1.360808
H  0.899615 5.19202 2.079711
H  2.81259 6.764639 2.094934
elementType: O C H
totalener: -1117.86888399 hartree
nucrepener: 2216.96434821 hartree
electener: -3334.83323219 hartree
oneelecener: -5923.73877753 hartree
twoeener: 2588.90554533 hartree
cpcmener: -0.02487756 hartree
kineticenergy: 1112.80565270 hartree
xcener: -110.227055319907 hartree
chargesum: -0.0000000
charge: -0.290302 -0.468661 -0.330093 0.155097 -0.024709 -0.079410 -0.290056 -0.279234 -0.293316 0.360965 -0.004131 -0.228536 -0.247314 0.103941 0.052528 -0.249154 -0.277534 0.263558 -0.116482 -0.197565 0.271821 -0.241586 -0.183635 -0.125623 -0.148280 -0.182445 0.104773 0.089737 0.097538 0.092255 0.099118 0.093180 0.093573 0.099067 0.121967 0.093931 0.095780 0.089353 0.101289 0.099038 0.077977 0.120513 0.113302 0.129762 0.147917 0.157237 0.155795 0.144764 0.158489 0.157316 0.158629 0.157853
qa: -0.2903 -0.4687 -0.3301 0.1551 -0.0247 -0.0794 -0.2901 -0.2792 -0.2933 0.3610 -0.0041 -0.2285 -0.2473 0.1039 0.0525 -0.2492 -0.2775 0.2636 -0.1165 -0.1976 0.2718 -0.2416 -0.1836 -0.1256 -0.1483 -0.1824 0.1048 0.0897 0.0975 0.0923 0.0991 0.0932 0.0936 0.0991 0.1220 0.0939 0.0958 0.0894 0.1013 0.0990 0.0780 0.1205 0.1133 0.1298 0.1479 0.1572 0.1558 0.1448 0.1585 0.1573 0.1586 0.1579
va: 2.1105 2.0345 2.0695 3.7040 3.8229 3.7811 3.9127 3.8855 3.8957 4.1725 3.7089 3.9292 3.9435 3.7923 3.6202 4.0678 3.9396 3.7461 3.8818 3.9255 3.7016 4.0043 3.9053 3.8876 3.8951 3.9015 1.0241 1.0335 1.0029 1.0014 0.9994 1.0011 1.0200 0.9991 1.0034 0.9965 0.9963 1.0063 1.0006 0.9971 1.0096 0.9913 1.0106 1.0191 1.0063 0.9913 0.9962 1.0082 0.9969 0.9893 0.9906 0.9905
dispcorr: -0.024818704 hartree
energy: -1117.893702689823
dipole: -28.84568 28.12522 -0.72046 -10.45316 10.36582 -0.08734 -4.50414 3.45188 -1.05226
magnitude: 1.27826 au
magnitude: 3.24907 debye
