program: Orca
programVersion: 5.0.2
elementType: O O O C C C C C C C C C C C C C C C C C C C C C C C H H H H H H H H H H H H H H H H H H H H H H H H H H
charge: 0
multiplicity: 1
keywords: wb97x-d3
keywords: def2-TZVPP
keywords: def2/J RIJCOSX
keywords: DEFGRID2
keywords: scfconv7
keywords: smallprint printgap noloewdin
keywords: NOSOSCF
formula: C23H26O3
InChI: InChI=1/C23H26O3/c1-16(2)13-20-21(23(20,3)4)22(24)25-15-17-9-8-12-19(14-17)26-18-10-6-5-7-11-18/h5-14,20-21H,15H2,1-4H3
52 atoms
O  0.154211 -2.825856 0.296741
O  0.304359 -2.547341 -1.910991
O  1.848929 1.806681 1.425164
C  -2.856287 -3.170646 -0.140706
C  -2.556177 -1.780949 0.304032
C  -1.822352 -2.353827 -0.901346
C  -4.132638 -3.433546 -0.904727
C  -2.454142 -4.333059 0.734675
C  -3.519268 -0.662453 0.135579
C  -0.367339 -2.587898 -0.905718
C  -3.18718 0.625379 0.010905
C  -4.2333 1.691615 -0.099135
C  -1.771773 1.114359 -0.019213
C  1.574366 -2.933374 0.393755
C  2.247407 -1.600236 0.227262
C  1.738566 -0.47895 0.877658
C  3.381423 -1.476026 -0.563676
C  2.368333 0.745184 0.733896
C  4.016026 -0.246368 -0.683949
C  3.517634 0.872501 -0.037615
C  1.590281 2.981896 0.779737
C  1.283245 3.050882 -0.574276
C  1.597418 4.131164 1.560592
C  0.995904 4.285057 -1.141234
C  1.298972 5.354666 0.980911
C  1.003288 5.440619 -0.373114
H  -1.942129 -1.719377 1.198669
H  -2.162581 -1.996597 -1.866839
H  -4.399084 -2.618029 -1.577228
H  -4.969074 -3.586575 -0.219247
H  -4.034967 -4.337388 -1.509264
H  -2.174118 -5.202117 0.135784
H  -3.30253 -4.626961 1.356417
H  -1.629946 -4.104814 1.405785
H  -4.574447 -0.921018 0.156237
H  -4.120367 2.437307 0.692593
H  -5.243548 1.286727 -0.037502
H  -4.142779 2.232212 -1.045151
H  -1.627783 1.82921 -0.832213
H  -1.044086 0.314521 -0.145163
H  -1.525325 1.645467 0.90409
H  1.962888 -3.66122 -0.321114
H  1.749722 -3.328272 1.394861
H  0.853667 -0.54782 1.499364
H  3.771308 -2.33927 -1.088778
H  4.904804 -0.155725 -1.294743
H  4.015079 1.829285 -0.135844
H  1.259474 2.160063 -1.188641
H  1.832816 4.063146 2.61544
H  0.759766 4.3360 -2.196344
H  1.306555 6.246817 1.593707
H  0.77865 6.39796 -0.824396
elementType: O C H
totalener: -1117.86668390 hartree
nucrepener: 2305.01124182 hartree
electener: -3422.87792571 hartree
oneelecener: -6099.49459155 hartree
twoeener: 2676.61666583 hartree
cpcmener: -0.02556308 hartree
kineticenergy: 1112.81489845 hartree
xcener: -110.230030897313 hartree
chargesum: -0.0000000
charge: -0.279624 -0.466940 -0.329413 0.158087 -0.018288 -0.099086 -0.297136 -0.275787 -0.297088 0.384358 0.004666 -0.227327 -0.243444 0.075997 0.045974 -0.288660 -0.202836 0.261705 -0.125937 -0.193885 0.317421 -0.222984 -0.256850 -0.149788 -0.121880 -0.190340 0.108357 0.089374 0.093365 0.098502 0.098381 0.100646 0.092475 0.091692 0.121202 0.094843 0.088317 0.095353 0.094044 0.060001 0.109372 0.116095 0.115769 0.141074 0.141773 0.158728 0.156533 0.155239 0.144452 0.158981 0.156593 0.157921
qa: -0.2796 -0.4669 -0.3294 0.1581 -0.0183 -0.0991 -0.2971 -0.2758 -0.2971 0.3844 0.0047 -0.2273 -0.2434 0.0760 0.0460 -0.2887 -0.2028 0.2617 -0.1259 -0.1939 0.3174 -0.2230 -0.2568 -0.1498 -0.1219 -0.1903 0.1084 0.0894 0.0934 0.0985 0.0984 0.1006 0.0925 0.0917 0.1212 0.0948 0.0883 0.0954 0.0940 0.0600 0.1094 0.1161 0.1158 0.1411 0.1418 0.1587 0.1565 0.1552 0.1445 0.1590 0.1566 0.1579
va: 2.1020 2.0402 2.0515 3.6912 3.7951 3.8186 3.9189 3.8919 3.8702 4.1601 3.7502 3.9280 3.9398 3.8228 3.6335 4.0081 3.9703 3.7515 3.8857 3.9403 3.6086 3.8558 4.0107 3.9028 3.8931 3.9084 1.0176 1.0295 1.0017 0.9994 1.0022 0.9997 1.0010 1.0142 1.0032 0.9954 1.0072 0.9969 1.0006 1.0094 0.9965 1.0078 0.9954 1.0171 1.0027 0.9900 0.9957 1.0003 1.0093 0.9903 0.9893 0.9901
dispcorr: -0.027498713 hartree
energy: -1117.894182608258
dipole: -22.86652 22.52269 -0.34383 -4.24879 4.34745 0.09866 -1.27596 1.89652 0.62057
magnitude: 0.71628 au
magnitude: 1.82064 debye
