program: Orca
programVersion: 5.0.2
elementType: O O O C C C C C C C C C C C C C C C C C C C C C C C H H H H H H H H H H H H H H H H H H H H H H H H H H
charge: 0
multiplicity: 1
keywords: wb97x-d3
keywords: def2-TZVPP
keywords: def2/J RIJCOSX
keywords: DEFGRID2
keywords: scfconv7
keywords: smallprint printgap noloewdin
keywords: NOSOSCF
formula: C23H26O3
InChI: InChI=1/C23H26O3/c1-16(2)13-20-21(23(20,3)4)22(24)25-15-17-9-8-12-19(14-17)26-18-10-6-5-7-11-18/h5-14,20-21H,15H2,1-4H3
52 atoms
O  0.024516 -2.349667 -0.093946
O  -1.02616 -1.050848 1.387728
O  2.227675 3.196671 0.136825
C  -3.372335 -3.107735 1.066171
C  -3.604092 -1.971985 0.133883
C  -2.253466 -2.680318 0.130065
C  -3.977382 -4.455438 0.752981
C  -3.287822 -2.828924 2.547065
C  -4.485115 -2.060236 -1.057825
C  -1.062032 -1.936654 0.566728
C  -4.391545 -1.266966 -2.128728
C  -5.334578 -1.399652 -3.284728
C  -3.352028 -0.197787 -2.273188
C  1.228213 -1.610599 0.099464
C  1.162531 -0.24781 -0.534679
C  1.737511 0.835737 0.115397
C  0.553363 -0.066059 -1.773914
C  1.720592 2.089902 -0.483367
C  0.516914 1.195901 -2.34605
C  1.107612 2.279585 -1.712373
C  3.423441 3.145864 0.796154
C  3.555228 3.964528 1.910199
C  4.491116 2.370742 0.358287
C  4.76425 4.007797 2.588584
C  5.690651 2.415947 1.054958
C  5.835618 3.230447 2.169773
H  -3.566966 -0.994245 0.607885
H  -2.080291 -3.350034 -0.704433
H  -3.420548 -5.248539 1.255926
H  -3.97634 -4.681915 -0.313301
H  -5.010481 -4.506937 1.103502
H  -4.272104 -2.96761 2.999858
H  -2.967093 -1.814758 2.773684
H  -2.600843 -3.519156 3.041135
H  -5.267215 -2.814184 -1.040783
H  -5.887003 -0.470813 -3.450996
H  -6.0601 -2.199808 -3.137284
H  -4.791552 -1.603439 -4.211666
H  -2.681599 -0.127083 -1.418196
H  -3.819388 0.781085 -2.411489
H  -2.742436 -0.372717 -3.164207
H  2.000415 -2.214246 -0.378728
H  1.479669 -1.537742 1.159644
H  2.187156 0.698845 1.09236
H  0.102062 -0.901433 -2.294162
H  0.033544 1.338403 -3.304139
H  1.088415 3.264015 -2.162816
H  2.716774 4.5672 2.237175
H  4.400456 1.74058 -0.517527
H  4.863467 4.649929 3.45443
H  6.520747 1.81075 0.713704
H  6.775414 3.261261 2.70513
elementType: O C H
totalener: -1117.86866156 hartree
nucrepener: 2214.20920323 hartree
electener: -3332.07786479 hartree
oneelecener: -5918.16783149 hartree
twoeener: 2586.08996670 hartree
cpcmener: -0.02535662 hartree
kineticenergy: 1112.80302906 hartree
xcener: -110.227051542268 hartree
chargesum: 0.0000000
charge: -0.291223 -0.468786 -0.328515 0.163871 -0.031212 -0.076612 -0.291940 -0.279181 -0.289065 0.359649 0.001817 -0.229757 -0.255113 0.102807 0.057546 -0.209085 -0.288008 0.273309 -0.101733 -0.252289 0.293113 -0.255483 -0.196186 -0.118288 -0.146032 -0.191036 0.103812 0.090184 0.097430 0.091084 0.099813 0.093395 0.093478 0.098981 0.122831 0.095184 0.089309 0.094093 0.078585 0.102811 0.096870 0.120189 0.112669 0.142385 0.147064 0.157143 0.146138 0.145568 0.154467 0.157475 0.159319 0.157157
qa: -0.2912 -0.4688 -0.3285 0.1639 -0.0312 -0.0766 -0.2919 -0.2792 -0.2891 0.3596 0.0018 -0.2298 -0.2551 0.1028 0.0575 -0.2091 -0.2880 0.2733 -0.1017 -0.2523 0.2931 -0.2555 -0.1962 -0.1183 -0.1460 -0.1910 0.1038 0.0902 0.0974 0.0911 0.0998 0.0934 0.0935 0.0990 0.1228 0.0952 0.0893 0.0941 0.0786 0.1028 0.0969 0.1202 0.1127 0.1424 0.1471 0.1571 0.1461 0.1456 0.1545 0.1575 0.1593 0.1572
va: 2.1099 2.0338 2.0769 3.7072 3.8302 3.7868 3.9146 3.8821 3.8906 4.1715 3.7049 3.9290 3.9484 3.8019 3.5964 3.9659 3.9423 3.7172 3.8688 4.0345 3.6948 4.0056 3.9019 3.8845 3.8943 3.9096 1.0232 1.0336 1.0029 1.0011 0.9990 1.0008 1.0199 0.9993 1.0034 0.9960 1.0066 0.9966 1.0092 1.0000 0.9968 0.9915 1.0118 1.0069 1.0070 0.9895 1.0061 1.0089 0.9985 0.9890 0.9902 0.9909
dispcorr: -0.024893402 hartree
energy: -1117.893554959843
dipole: -25.32000 25.49660 0.17660 -16.14328 15.14922 -0.99406 -5.13823 4.29528 -0.84295
magnitude: 1.31526 au
magnitude: 3.34312 debye
