program: Orca
programVersion: 5.0.2
elementType: O O O C C C C C C C C C C C C C C C C C C C C C C C H H H H H H H H H H H H H H H H H H H H H H H H H H
charge: 0
multiplicity: 1
keywords: wb97x-d3
keywords: def2-TZVPP
keywords: def2/J RIJCOSX
keywords: DEFGRID2
keywords: scfconv7
keywords: smallprint printgap noloewdin
keywords: NOSOSCF
formula: C23H26O3
InChI: InChI=1/C23H26O3/c1-16(2)13-20-21(23(20,3)4)22(24)25-15-17-9-8-12-19(14-17)26-18-10-6-5-7-11-18/h5-14,20-21H,15H2,1-4H3
52 atoms
O  0.655692 -2.197242 -1.356039
O  0.193601 -2.449782 0.813773
O  3.098881 2.111268 -0.008557
C  -2.765507 -2.482658 -0.237806
C  -2.45436 -1.122666 0.308508
C  -1.518941 -1.748306 -0.706486
C  -3.863542 -2.62987 -1.263232
C  -2.659122 -3.675145 0.680147
C  -3.210966 0.086292 -0.087181
C  -0.164622 -2.165495 -0.304268
C  -3.905751 0.886175 0.7276
C  -4.59599 2.106467 0.197296
C  -4.050522 0.671324 2.202804
C  2.018223 -2.556968 -1.123823
C  2.765327 -1.524901 -0.326181
C  2.558607 -0.169966 -0.55977
C  3.68956 -1.926457 0.631087
C  3.250082 0.768824 0.193628
C  4.402294 -0.978059 1.349738
C  4.177576 0.37469 1.147803
C  1.863069 2.660083 -0.202933
C  1.809166 3.789038 -1.009946
C  0.712761 2.175079 0.409826
C  0.598265 4.436206 -1.205381
C  -0.493154 2.828319 0.195888
C  -0.560123 3.956673 -0.609824
H  -2.076125 -1.129086 1.325891
H  -1.584864 -1.349606 -1.713216
H  -3.897648 -1.801548 -1.970052
H  -4.837515 -2.686835 -0.772095
H  -3.730027 -3.548733 -1.83764
H  -2.339811 -4.565621 0.134248
H  -3.640145 -3.890494 1.108676
H  -1.971402 -3.524226 1.50903
H  -3.183982 0.343014 -1.142579
H  -5.674769 2.058694 0.369502
H  -4.432506 2.240878 -0.872192
H  -4.244652 3.008503 0.706482
H  -3.592973 1.493113 2.760849
H  -3.607742 -0.258729 2.555053
H  -5.106525 0.660221 2.485992
H  2.445634 -2.654154 -2.122627
H  2.081277 -3.535361 -0.642356
H  1.856604 0.155184 -1.318646
H  3.848068 -2.98094 0.820741
H  5.122443 -1.292656 2.093825
H  4.714262 1.117618 1.724228
H  2.712912 4.160644 -1.476738
H  0.741611 1.302124 1.049824
H  0.564478 5.316847 -1.833951
H  -1.388615 2.447372 0.670208
H  -1.505944 4.457685 -0.768962
elementType: O C H
totalener: -1117.86996080 hartree
nucrepener: 2308.96579085 hartree
electener: -3426.83575165 hartree
oneelecener: -6107.62198490 hartree
twoeener: 2680.78623325 hartree
cpcmener: -0.02529999 hartree
kineticenergy: 1112.80706515 hartree
xcener: -110.229137621596 hartree
chargesum: 0.0000000
charge: -0.292877 -0.467897 -0.329764 0.128777 0.052557 -0.109225 -0.262103 -0.286475 -0.324776 0.389930 -0.029200 -0.231591 -0.254659 0.102199 0.041446 -0.248188 -0.221671 0.281165 -0.111527 -0.254527 0.324218 -0.270562 -0.230555 -0.094832 -0.112126 -0.238940 0.096702 0.086707 0.088141 0.096127 0.097373 0.099878 0.094520 0.093687 0.120014 0.104165 0.090830 0.090435 0.095397 0.090003 0.099373 0.121520 0.114319 0.142901 0.140549 0.156344 0.145479 0.143645 0.150023 0.156628 0.183402 0.153039
qa: -0.2929 -0.4679 -0.3298 0.1288 0.0526 -0.1092 -0.2621 -0.2865 -0.3248 0.3899 -0.0292 -0.2316 -0.2547 0.1022 0.0414 -0.2482 -0.2217 0.2812 -0.1115 -0.2545 0.3242 -0.2706 -0.2306 -0.0948 -0.1121 -0.2389 0.0967 0.0867 0.0881 0.0961 0.0974 0.0999 0.0945 0.0937 0.1200 0.1042 0.0908 0.0904 0.0954 0.0900 0.0994 0.1215 0.1143 0.1429 0.1405 0.1563 0.1455 0.1436 0.1500 0.1566 0.1834 0.1530
va: 2.1158 2.0340 2.0820 3.7151 3.7140 3.8719 3.9063 3.9032 3.8505 4.1533 3.7123 3.9156 3.9441 3.7980 3.6066 3.9399 3.9687 3.7163 3.8916 4.0211 3.6705 4.0183 3.9331 3.8747 3.8199 3.9525 1.0271 1.0404 1.0043 1.0026 1.0028 0.9991 1.0007 1.0194 1.0090 0.9983 1.0078 0.9944 0.9963 1.0084 0.9975 0.9917 1.0087 1.0160 1.0033 0.9894 1.0065 1.0095 1.0088 0.9888 0.9651 0.9959
dispcorr: -0.026549783 hartree
energy: -1117.896510578145
dipole: -30.74233 29.84461 -0.89772 -4.22397 4.05837 -0.16560 2.73290 -3.42996 -0.69706
magnitude: 1.14858 au
magnitude: 2.91945 debye
