program: Orca
programVersion: 5.0.2
elementType: O O O C C C C C C C C C C C C C C C C C C C C C C C H H H H H H H H H H H H H H H H H H H H H H H H H H
charge: 0
multiplicity: 1
keywords: wb97x-d3
keywords: def2-TZVPP
keywords: def2/J RIJCOSX
keywords: DEFGRID2
keywords: scfconv7
keywords: smallprint printgap noloewdin
keywords: NOSOSCF
formula: C23H26O3
InChI: InChI=1/C23H26O3/c1-16(2)13-20-21(23(20,3)4)22(24)25-15-17-9-8-12-19(14-17)26-18-10-6-5-7-11-18/h5-14,20-21H,15H2,1-4H3
52 atoms
O  0.755443 -2.576059 -1.077839
O  0.204788 -2.197929 1.054547
O  2.729819 2.016626 -0.477285
C  -2.728138 -2.175392 -0.068011
C  -2.231189 -0.765137 0.009244
C  -1.392173 -1.812183 -0.693518
C  -3.830311 -2.502186 -1.045773
C  -2.798152 -2.993264 1.197298
C  -2.826348 0.334909 -0.786751
C  -0.097018 -2.208574 -0.114445
C  -3.646369 1.274527 -0.308053
C  -4.185997 2.35564 -1.193385
C  -4.101938 1.334145 1.117336
C  2.0971 -2.862434 -0.708832
C  2.885941 -1.633596 -0.33969
C  2.41946 -0.353536 -0.60022
C  4.134898 -1.796589 0.256062
C  3.180927 0.747229 -0.227595
C  4.900051 -0.691046 0.588355
C  4.423271 0.593921 0.362493
C  1.496197 2.385281 -0.015867
C  0.805127 3.332907 -0.759895
C  0.958969 1.886234 1.165637
C  -0.423539 3.793256 -0.309724
C  -0.275085 2.351602 1.59886
C  -0.970786 3.305567 0.869193
H  -1.85481 -0.483446 0.988914
H  -1.398071 -1.769739 -1.777413
H  -3.832227 -3.568326 -1.281373
H  -3.737403 -1.957421 -1.985067
H  -4.804826 -2.257237 -0.617676
H  -3.798749 -2.90975 1.626763
H  -2.091487 -2.66928 1.957728
H  -2.61738 -4.05131 0.99578
H  -2.573575 0.364934 -1.842894
H  -5.279476 2.353709 -1.196616
H  -3.846172 2.253152 -2.224125
H  -3.881928 3.343407 -0.835546
H  -3.578322 0.637755 1.771165
H  -5.170197 1.106862 1.185943
H  -3.976008 2.339967 1.526719
H  2.532782 -3.336411 -1.589438
H  2.132108 -3.592797 0.103026
H  1.467037 -0.189041 -1.089528
H  4.508219 -2.792628 0.462822
H  5.869622 -0.826445 1.04993
H  5.005874 1.461769 0.644178
H  1.232415 3.710572 -1.680557
H  1.492543 1.150997 1.754628
H  -0.956603 4.534753 -0.890959
H  -0.690082 1.964041 2.520606
H  -1.930102 3.665599 1.216621
elementType: O C H
totalener: -1117.86911466 hartree
nucrepener: 2357.33073948 hartree
electener: -3475.19985415 hartree
oneelecener: -6204.70201399 hartree
twoeener: 2729.50215985 hartree
cpcmener: -0.02654598 hartree
kineticenergy: 1112.80371073 hartree
xcener: -110.230086150667 hartree
chargesum: 0.0000000
charge: -0.295224 -0.458782 -0.333259 0.169734 -0.032385 -0.085283 -0.267793 -0.298233 -0.233167 0.356761 -0.058018 -0.229636 -0.263862 0.087104 0.028425 -0.190210 -0.226691 0.232746 -0.124784 -0.225768 0.276248 -0.231541 -0.166733 -0.136495 -0.179382 -0.173821 0.096105 0.089429 0.098553 0.090308 0.095794 0.093465 0.093378 0.100116 0.119612 0.101859 0.092053 0.086541 0.093263 0.111493 0.091159 0.128182 0.116627 0.146739 0.142470 0.157210 0.146719 0.144006 0.150209 0.155199 0.158033 0.161527
qa: -0.2952 -0.4588 -0.3333 0.1697 -0.0324 -0.0853 -0.2678 -0.2982 -0.2332 0.3568 -0.0580 -0.2296 -0.2639 0.0871 0.0284 -0.1902 -0.2267 0.2327 -0.1248 -0.2258 0.2762 -0.2315 -0.1667 -0.1365 -0.1794 -0.1738 0.0961 0.0894 0.0986 0.0903 0.0958 0.0935 0.0934 0.1001 0.1196 0.1019 0.0921 0.0865 0.0933 0.1115 0.0912 0.1282 0.1166 0.1467 0.1425 0.1572 0.1467 0.1440 0.1502 0.1552 0.1580 0.1615
va: 2.1148 2.0373 2.0712 3.7322 3.7558 3.8917 3.9068 3.8982 3.7861 4.1727 3.7248 3.9205 3.9323 3.8077 3.6277 3.9375 3.9742 3.7627 3.8867 4.0072 3.6946 4.0059 3.8414 3.8859 3.8746 3.8444 1.0236 1.0381 1.0031 1.0027 1.0029 1.0011 1.0196 0.9993 1.0083 0.9980 1.0069 0.9968 1.0064 0.9992 1.0005 0.9909 1.0105 1.0095 1.0002 0.9890 1.0046 1.0080 1.0027 0.9915 0.9932 0.9832
dispcorr: -0.029075384 hartree
energy: -1117.898190046885
dipole: -29.79399 29.02101 -0.77298 -1.54806 1.15633 -0.39172 1.24592 -1.74069 -0.49477
magnitude: 0.99787 au
magnitude: 2.53638 debye
