program: Orca
programVersion: 5.0.2
elementType: O O O C C C C C C C C C C C C C C C C C C C C C C C H H H H H H H H H H H H H H H H H H H H H H H H H H
charge: 0
multiplicity: 1
keywords: wb97x-d3
keywords: def2-TZVPP
keywords: def2/J RIJCOSX
keywords: DEFGRID2
keywords: scfconv7
keywords: smallprint printgap noloewdin
keywords: NOSOSCF
formula: C23H26O3
InChI: InChI=1/C23H26O3/c1-16(2)13-20-21(23(20,3)4)22(24)25-15-17-9-8-12-19(14-17)26-18-10-6-5-7-11-18/h5-14,20-21H,15H2,1-4H3
52 atoms
O  0.715444 -2.552566 -0.397932
O  -0.214023 -1.776789 1.487836
O  3.132323 2.09061 0.396219
C  -2.87281 -2.412907 -0.050932
C  -2.585439 -0.942648 -0.109579
C  -1.509233 -1.931584 -0.516616
C  -3.748774 -3.036824 -1.111224
C  -3.037561 -3.063357 1.300791
C  -3.175688 -0.060079 -1.136338
C  -0.299595 -2.066823 0.317258
C  -3.845423 1.076721 -0.917529
C  -4.40664 1.867861 -2.061063
C  -4.118869 1.659256 0.435871
C  2.010774 -2.688784 0.206532
C  2.880047 -1.525108 -0.1762
C  2.608148 -0.260111 0.33741
C  3.93399 -1.692777 -1.06657
C  3.362336 0.828931 -0.073565
C  4.710353 -0.602442 -1.436858
C  4.422754 0.664403 -0.955873
C  1.849698 2.491204 0.664103
C  0.798511 2.22592 -0.206622
C  1.640233 3.222741 1.823514
C  -0.472099 2.68597 0.104713
C  0.36573 3.689592 2.115004
C  -0.69587 3.417306 1.264231
H  -2.420961 -0.490503 0.862874
H  -1.332242 -2.032195 -1.581984
H  -3.584822 -4.115299 -1.157061
H  -3.565066 -2.636581 -2.107624
H  -4.803294 -2.874023 -0.878388
H  -2.510485 -2.542813 2.096851
H  -2.687969 -4.097983 1.284298
H  -4.095774 -3.081206 1.569847
H  -3.054427 -0.380632 -2.167289
H  -4.202498 1.403121 -3.025796
H  -3.992815 2.879815 -2.080228
H  -5.490187 1.981263 -1.965832
H  -3.565179 1.182636 1.242688
H  -5.182708 1.578763 0.677304
H  -3.882968 2.725997 0.453887
H  2.421469 -3.618418 -0.18576
H  1.92558 -2.788234 1.288862
H  1.807471 -0.127957 1.054107
H  4.150061 -2.673896 -1.471112
H  5.535403 -0.735755 -2.124483
H  5.012717 1.520073 -1.259694
H  0.960986 1.665367 -1.118839
H  2.468387 3.42486 2.491272
H  -1.290024 2.472782 -0.571902
H  0.204812 4.26229 3.019295
H  -1.689584 3.7751 1.499865
elementType: O C H
totalener: -1117.86911802 hartree
nucrepener: 2310.51983803 hartree
electener: -3428.38895606 hartree
oneelecener: -6110.72998909 hartree
twoeener: 2682.34103303 hartree
cpcmener: -0.02402086 hartree
kineticenergy: 1112.79591108 hartree
xcener: -110.226035822907 hartree
chargesum: 0.0000000
charge: -0.285061 -0.478010 -0.331538 0.106537 0.035801 -0.083163 -0.266157 -0.279305 -0.267691 0.398732 -0.069037 -0.213668 -0.282439 0.086785 -0.014135 -0.176685 -0.231672 0.263979 -0.104478 -0.254602 0.298194 -0.214386 -0.249448 -0.123742 -0.116181 -0.208965 0.093362 0.087428 0.097421 0.087271 0.096725 0.093005 0.098234 0.094426 0.117129 0.087898 0.091227 0.097506 0.097074 0.114968 0.091211 0.111057 0.118110 0.150791 0.142883 0.157591 0.146312 0.151191 0.144909 0.179691 0.156728 0.156190
qa: -0.2851 -0.4780 -0.3315 0.1065 0.0358 -0.0832 -0.2662 -0.2793 -0.2677 0.3987 -0.0690 -0.2137 -0.2824 0.0868 -0.0141 -0.1767 -0.2317 0.2640 -0.1045 -0.2546 0.2982 -0.2144 -0.2494 -0.1237 -0.1162 -0.2090 0.0934 0.0874 0.0974 0.0873 0.0967 0.0930 0.0982 0.0944 0.1171 0.0879 0.0912 0.0975 0.0971 0.1150 0.0912 0.1111 0.1181 0.1508 0.1429 0.1576 0.1463 0.1512 0.1449 0.1797 0.1567 0.1562
va: 2.1286 2.0191 2.0793 3.7294 3.7390 3.8557 3.9115 3.9032 3.8269 4.1594 3.7598 3.9142 3.9380 3.8041 3.7220 3.8684 3.9765 3.7679 3.8894 4.0198 3.6763 3.9353 4.0222 3.8312 3.9039 3.9298 1.0302 1.0378 1.0024 1.0059 1.0022 1.0198 0.9992 1.0005 1.0109 1.0094 0.9965 0.9957 1.0062 0.9996 0.9936 1.0009 1.0184 1.0208 1.0038 0.9885 1.0066 1.0022 1.0079 0.9724 0.9897 0.9924
dispcorr: -0.026701726 hartree
energy: -1117.895819750094
dipole: -30.69214 30.01495 -0.67719 -3.39016 2.96870 -0.42146 -4.19536 3.28369 -0.91168
magnitude: 1.21135 au
magnitude: 3.07900 debye
