program: Orca
programVersion: 5.0.2
elementType: O O O C C C C C C C C C C C C C C C C C C C C C C C H H H H H H H H H H H H H H H H H H H H H H H H H H
charge: 0
multiplicity: 1
keywords: wb97x-d3
keywords: def2-TZVPP
keywords: def2/J RIJCOSX
keywords: DEFGRID2
keywords: scfconv7
keywords: smallprint printgap noloewdin
keywords: NOSOSCF
formula: C23H26O3
InChI: InChI=1/C23H26O3/c1-16(2)13-20-21(23(20,3)4)22(24)25-15-17-9-8-12-19(14-17)26-18-10-6-5-7-11-18/h5-14,20-21H,15H2,1-4H3
52 atoms
O  0.719404 -2.584255 -0.385262
O  -0.182294 -1.724711 1.477018
O  3.105212 2.096592 0.372258
C  -2.872048 -2.371609 0.01093
C  -2.549592 -0.916275 -0.143864
C  -1.50371 -1.956279 -0.502142
C  -3.778911 -3.03388 -0.998957
C  -3.035892 -2.932564 1.40254
C  -3.131081 -0.082713 -1.216761
C  -0.283899 -2.063071 0.320723
C  -3.804092 1.06176 -1.055484
C  -4.34574 1.80713 -2.238396
C  -4.097769 1.699488 0.26765
C  2.024367 -2.692275 0.205771
C  2.87054 -1.519881 -0.201819
C  2.609848 -0.260133 0.330399
C  3.886885 -1.672206 -1.137775
C  3.332235 0.839114 -0.109277
C  4.635675 -0.572039 -1.534973
C  4.355471 0.689916 -1.036932
C  1.83079 2.473585 0.704373
C  0.743795 2.191804 -0.115589
C  1.664368 3.196657 1.875828
C  -0.518151 2.625901 0.259836
C  0.396965 3.637482 2.231806
C  -0.699795 3.346881 1.433118
H  -2.357567 -0.4069 0.794908
H  -1.347132 -2.126805 -1.561794
H  -4.825435 -2.828362 -0.763572
H  -3.644615 -4.117256 -0.982178
H  -3.59813 -2.697784 -2.01943
H  -2.498519 -2.368805 2.16126
H  -2.698755 -3.970286 1.450955
H  -4.092801 -2.920429 1.676933
H  -2.998617 -0.448219 -2.231017
H  -5.430893 1.921531 -2.168738
H  -4.121522 1.307495 -3.180769
H  -3.933044 2.818413 -2.287472
H  -3.811119 2.753733 0.262189
H  -3.599664 1.222618 1.10963
H  -5.172163 1.67819 0.469249
H  2.443222 -3.620111 -0.181763
H  1.953165 -2.78132 1.290058
H  1.840904 -0.140735 1.082718
H  4.095945 -2.648628 -1.557002
H  5.432326 -0.693365 -2.257373
H  4.922594 1.552771 -1.363032
H  0.870876 1.638487 -1.037774
H  2.519977 3.41236 2.503534
H  -1.362879 2.398967 -0.378014
H  0.269656 4.20185 3.146633
H  -1.687882 3.682434 1.719738
elementType: O C H
totalener: -1117.86891736 hartree
nucrepener: 2315.12982585 hartree
electener: -3432.99874321 hartree
oneelecener: -6119.96307092 hartree
twoeener: 2686.96432770 hartree
cpcmener: -0.02391005 hartree
kineticenergy: 1112.80225710 hartree
xcener: -110.227551124042 hartree
chargesum: -0.0000000
charge: -0.284871 -0.477876 -0.331641 0.109991 0.030519 -0.082000 -0.266483 -0.281296 -0.265063 0.395324 -0.058932 -0.218996 -0.282380 0.085774 -0.015355 -0.182730 -0.231334 0.269662 -0.104411 -0.255842 0.301755 -0.233439 -0.251167 -0.101931 -0.110726 -0.218805 0.091445 0.087273 0.096427 0.097906 0.087310 0.093892 0.098486 0.094020 0.117357 0.096249 0.088368 0.092807 0.092445 0.096317 0.114007 0.111793 0.118302 0.152427 0.142987 0.157301 0.146379 0.150821 0.144957 0.183097 0.156840 0.153040
qa: -0.2849 -0.4779 -0.3316 0.1100 0.0305 -0.0820 -0.2665 -0.2813 -0.2651 0.3953 -0.0589 -0.2190 -0.2824 0.0858 -0.0154 -0.1827 -0.2313 0.2697 -0.1044 -0.2558 0.3018 -0.2334 -0.2512 -0.1019 -0.1107 -0.2188 0.0914 0.0873 0.0964 0.0979 0.0873 0.0939 0.0985 0.0940 0.1174 0.0962 0.0884 0.0928 0.0924 0.0963 0.1140 0.1118 0.1183 0.1524 0.1430 0.1573 0.1464 0.1508 0.1450 0.1831 0.1568 0.1530
va: 2.1289 2.0189 2.0808 3.7280 3.7425 3.8653 3.9120 3.9019 3.8221 4.1550 3.7547 3.9167 3.9401 3.8052 3.7157 3.8669 3.9786 3.7652 3.8878 4.0211 3.6747 3.9572 4.0229 3.8058 3.9031 3.9429 1.0295 1.0383 1.0024 1.0023 1.0054 1.0196 0.9992 1.0005 1.0106 0.9957 1.0092 0.9960 0.9919 1.0062 0.9998 1.0005 1.0175 1.0209 1.0035 0.9886 1.0066 1.0033 1.0078 0.9647 0.9895 0.9950
dispcorr: -0.026890904 hartree
energy: -1117.895808261836
dipole: -30.60316 29.90726 -0.69589 -3.25324 2.81104 -0.44221 -4.29931 3.40901 -0.89030
magnitude: 1.21345 au
magnitude: 3.08433 debye
