program: Orca
programVersion: 5.0.2
elementType: O O O C C C C C C C C C C C C C C C C C C C C C C C H H H H H H H H H H H H H H H H H H H H H H H H H H
charge: 0
multiplicity: 1
keywords: wb97x-d3
keywords: def2-TZVPP
keywords: def2/J RIJCOSX
keywords: DEFGRID2
keywords: scfconv7
keywords: smallprint printgap noloewdin
keywords: NOSOSCF
formula: C23H26O3
InChI: InChI=1/C23H26O3/c1-16(2)13-20-21(23(20,3)4)22(24)25-15-17-9-8-12-19(14-17)26-18-10-6-5-7-11-18/h5-14,20-21H,15H2,1-4H3
52 atoms
O  0.012132 -2.548012 -1.200066
O  -1.008081 -0.561363 -1.175909
O  3.531707 2.173782 -0.826873
C  -2.599238 -2.113894 1.109513
C  -3.462531 -1.835889 -0.087858
C  -2.11268 -2.489263 -0.279891
C  -2.94111 -3.264135 2.024222
C  -1.981067 -0.945425 1.838368
C  -4.68478 -2.611154 -0.384753
C  -1.0147 -1.74227 -0.923167
C  -5.892577 -2.114516 -0.672541
C  -7.045626 -3.025279 -0.9736
C  -6.224088 -0.654282 -0.731554
C  1.173265 -1.953077 -1.78085
C  1.912679 -1.073537 -0.81183
C  2.352215 0.179395 -1.217402
C  2.177146 -1.50726 0.483972
C  3.07172 0.981022 -0.343079
C  2.8839 -0.690763 1.353907
C  3.342156 0.554882 0.950204
C  3.462601 3.29645 -0.047852
C  4.538811 4.17122 -0.097512
C  2.342015 3.592964 0.719352
C  4.489469 5.355835 0.623618
C  2.311532 4.776263 1.44297
C  3.380542 5.661612 1.400243
H  -3.489226 -0.78988 -0.374364
H  -2.110096 -3.554615 -0.485426
H  -3.708837 -2.966381 2.741621
H  -2.062056 -3.574682 2.592608
H  -3.309102 -4.139237 1.489871
H  -1.82602 -0.07443 1.204502
H  -1.01703 -1.218917 2.273217
H  -2.632934 -0.636713 2.658123
H  -4.576932 -3.69218 -0.373664
H  -7.853031 -2.890071 -0.248744
H  -6.757273 -4.076437 -0.96193
H  -7.474367 -2.806014 -1.95522
H  -6.493471 -0.359333 -1.748729
H  -5.416089 -0.005022 -0.402304
H  -7.09475 -0.43489 -0.109324
H  0.913113 -1.403632 -2.688098
H  1.793817 -2.799839 -2.075835
H  2.136021 0.538646 -2.216872
H  1.839013 -2.480553 0.817413
H  3.093672 -1.030704 2.359859
H  3.905792 1.176496 1.634602
H  5.404238 3.92754 -0.701169
H  1.496567 2.916784 0.749638
H  5.32886 6.03803 0.581487
H  1.43865 5.008482 2.039483
H  3.347499 6.583654 1.965491
elementType: O C H
totalener: -1117.87067272 hartree
nucrepener: 2182.88653434 hartree
electener: -3300.75720706 hartree
oneelecener: -5855.63504488 hartree
twoeener: 2554.87783782 hartree
cpcmener: -0.02597237 hartree
kineticenergy: 1112.80641407 hartree
xcener: -110.227123715855 hartree
chargesum: -0.0000000
charge: -0.286986 -0.461627 -0.331165 0.108746 0.037473 -0.097444 -0.268634 -0.275558 -0.282364 0.380741 -0.041532 -0.220253 -0.253280 0.098251 0.048956 -0.242790 -0.262106 0.247529 -0.121725 -0.185543 0.259877 -0.237383 -0.172257 -0.129090 -0.154891 -0.178611 0.089842 0.089766 0.096860 0.097198 0.087620 0.094007 0.093837 0.099122 0.116675 0.093674 0.087422 0.092433 0.097995 0.090507 0.092848 0.115068 0.122640 0.131146 0.140150 0.158732 0.156312 0.145738 0.158390 0.157242 0.159105 0.157339
qa: -0.2870 -0.4616 -0.3312 0.1087 0.0375 -0.0974 -0.2686 -0.2756 -0.2824 0.3807 -0.0415 -0.2203 -0.2533 0.0983 0.0490 -0.2428 -0.2621 0.2475 -0.1217 -0.1855 0.2599 -0.2374 -0.1723 -0.1291 -0.1549 -0.1786 0.0898 0.0898 0.0969 0.0972 0.0876 0.0940 0.0938 0.0991 0.1167 0.0937 0.0874 0.0924 0.0980 0.0905 0.0928 0.1151 0.1226 0.1311 0.1402 0.1587 0.1563 0.1457 0.1584 0.1572 0.1591 0.1573
va: 2.1174 2.0468 2.0654 3.6980 3.7798 3.8191 3.9059 3.9034 3.8788 4.2194 3.7534 3.9231 3.9430 3.7922 3.6075 4.0611 3.9424 3.7571 3.8856 3.9199 3.7114 3.9996 3.8917 3.8913 3.8999 3.8980 1.0354 1.0364 1.0021 1.0021 1.0056 1.0167 1.0017 1.0014 1.0105 0.9963 1.0091 0.9958 0.9964 1.0092 0.9979 1.0099 0.9918 1.0189 1.0132 0.9899 0.9958 1.0077 0.9970 0.9893 0.9906 0.9905
dispcorr: -0.023534440 hartree
energy: -1117.894207155761
dipole: -32.83931 32.54147 -0.29784 -12.16513 11.35590 -0.80923 8.12341 -7.27645 0.84696
magnitude: 1.20868 au
magnitude: 3.07221 debye
