program: Orca
programVersion: 5.0.2
elementType: O O O C C C C C C C C C C C C C C C C C C C C C C C H H H H H H H H H H H H H H H H H H H H H H H H H H
charge: 0
multiplicity: 1
keywords: wb97x-d3
keywords: def2-TZVPP
keywords: def2/J RIJCOSX
keywords: DEFGRID2
keywords: scfconv7
keywords: smallprint printgap noloewdin
keywords: NOSOSCF
formula: C23H26O3
InChI: InChI=1/C23H26O3/c1-16(2)13-20-21(23(20,3)4)22(24)25-15-17-9-8-12-19(14-17)26-18-10-6-5-7-11-18/h5-14,20-21H,15H2,1-4H3
52 atoms
O  0.323735 -2.922167 0.209645
O  0.665348 -2.698042 -1.982231
O  1.861622 1.720241 1.429345
C  -2.670639 -2.650818 -0.341035
C  -2.097423 -1.298648 -0.04559
C  -1.470147 -2.169684 -1.131422
C  -3.956538 -2.756059 -1.128051
C  -2.546038 -3.733339 0.704905
C  -2.731714 -0.024756 -0.431207
C  -0.074447 -2.63158 -1.028006
C  -2.760371 1.074223 0.32977
C  -3.391084 2.340205 -0.162123
C  -2.160928 1.133871 1.710115
C  1.730104 -3.043439 0.43725
C  2.401074 -1.704822 0.306359
C  1.839687 -0.59519 0.934232
C  3.552454 -1.548996 -0.452917
C  2.427632 0.647268 0.787017
C  4.146414 -0.298715 -0.574693
C  3.584667 0.810181 0.036763
C  1.206005 2.662937 0.691457
C  0.803684 2.464013 -0.624394
C  0.917461 3.857641 1.342655
C  0.127094 3.481149 -1.286444
C  0.236526 4.858752 0.669107
C  -0.157323 4.680888 -0.651513
H  -1.524285 -1.259688 0.874572
H  -1.702819 -1.870654 -2.14765
H  -4.020954 -2.035688 -1.942996
H  -4.818146 -2.597295 -0.476225
H  -4.054316 -3.75156 -1.565847
H  -2.416233 -4.714391 0.243134
H  -3.463395 -3.771111 1.296239
H  -1.724033 -3.575034 1.39838
H  -3.181384 0.020239 -1.418686
H  -4.231817 2.633813 0.472901
H  -3.757237 2.250182 -1.18509
H  -2.679367 3.169932 -0.130395
H  -2.447961 2.051143 2.224668
H  -1.068887 1.116735 1.680593
H  -2.476056 0.298962 2.33765
H  2.179151 -3.780766 -0.23025
H  1.810664 -3.423548 1.455732
H  0.94046 -0.688545 1.532202
H  3.985712 -2.403911 -0.957191
H  5.045565 -0.184506 -1.165933
H  4.037367 1.788484 -0.067312
H  1.003356 1.53372 -1.140294
H  1.22779 3.997576 2.370809
H  -0.182189 3.323058 -2.311774
H  0.017611 5.786933 1.181405
H  -0.683266 5.466924 -1.177038
elementType: O C H
totalener: -1117.86529567 hartree
nucrepener: 2363.88953842 hartree
electener: -3481.75483409 hartree
oneelecener: -6217.27733979 hartree
twoeener: 2735.52250570 hartree
cpcmener: -0.02631223 hartree
kineticenergy: 1112.80730915 hartree
xcener: -110.228515072304 hartree
chargesum: -0.0000000
charge: -0.284040 -0.463210 -0.329354 0.101369 0.062766 -0.082110 -0.277978 -0.270954 -0.290784 0.373813 -0.027239 -0.219840 -0.294686 0.076611 -0.007114 -0.213288 -0.169597 0.193321 -0.141245 -0.159144 0.257732 -0.136895 -0.226152 -0.213199 -0.122153 -0.173063 0.094401 0.083993 0.088100 0.097501 0.098367 0.099379 0.092679 0.090523 0.114149 0.104733 0.088787 0.084923 0.103018 0.086043 0.114553 0.115865 0.115779 0.146585 0.142593 0.158206 0.155967 0.148155 0.142276 0.157596 0.156074 0.156189
qa: -0.2840 -0.4632 -0.3294 0.1014 0.0628 -0.0821 -0.2780 -0.2710 -0.2908 0.3738 -0.0272 -0.2198 -0.2947 0.0766 -0.0071 -0.2133 -0.1696 0.1933 -0.1412 -0.1591 0.2577 -0.1369 -0.2262 -0.2132 -0.1222 -0.1731 0.0944 0.0840 0.0881 0.0975 0.0984 0.0994 0.0927 0.0905 0.1141 0.1047 0.0888 0.0849 0.1030 0.0860 0.1146 0.1159 0.1158 0.1466 0.1426 0.1582 0.1560 0.1482 0.1423 0.1576 0.1561 0.1562
va: 2.0981 2.0409 2.0431 3.7215 3.7239 3.8261 3.9201 3.8991 3.8769 4.1963 3.6880 3.9120 3.9418 3.8300 3.6742 3.9735 3.9366 3.8200 3.8974 3.9559 3.6288 3.7660 3.9741 3.8959 3.8906 3.8400 1.0146 1.0343 1.0065 1.0012 1.0009 1.0008 0.9999 1.0152 1.0129 0.9962 1.0109 0.9952 1.0051 0.9960 0.9991 1.0074 0.9967 1.0080 1.0020 0.9898 0.9961 1.0079 1.0100 0.9922 0.9886 0.9910
dispcorr: -0.029453671 hartree
energy: -1117.894749339504
dipole: -23.25345 22.74015 -0.51330 -0.89658 0.97037 0.07380 1.30006 -0.57877 0.72129
magnitude: 0.88836 au
magnitude: 2.25802 debye
