program: Orca
programVersion: 5.0.2
elementType: O O O C C C C C C C C C C C C C C C C C C C C C C C H H H H H H H H H H H H H H H H H H H H H H H H H H
charge: 0
multiplicity: 1
keywords: wb97x-d3
keywords: def2-TZVPP
keywords: def2/J RIJCOSX
keywords: DEFGRID2
keywords: scfconv7
keywords: smallprint printgap noloewdin
keywords: NOSOSCF
formula: C23H26O3
InChI: InChI=1/C23H26O3/c1-16(2)13-20-21(23(20,3)4)22(24)25-15-17-9-8-12-19(14-17)26-18-10-6-5-7-11-18/h5-14,20-21H,15H2,1-4H3
52 atoms
O  -0.067793 -2.406516 -1.25987
O  -1.223001 -0.494729 -1.295461
O  3.711182 2.183953 -0.782137
C  -2.832985 -2.079938 0.927639
C  -3.63564 -1.994654 -0.336169
C  -2.213199 -2.487176 -0.402118
C  -3.109369 -3.204567 1.893886
C  -2.420866 -0.798399 1.60805
C  -4.740434 -2.939212 -0.6389
C  -1.157624 -1.670425 -1.02787
C  -6.037688 -2.68608 -0.445984
C  -7.08921 -3.691184 -0.804704
C  -6.553432 -1.403428 0.129946
C  1.082098 -1.740501 -1.773076
C  1.747236 -0.858449 -0.752675
C  2.369855 0.308309 -1.174694
C  1.793103 -1.211043 0.593001
C  3.057893 1.102011 -0.26712
C  2.466113 -0.399174 1.493638
C  3.111435 0.756248 1.07687
C  3.82825 3.345893 -0.071286
C  5.036224 4.021803 -0.171449
C  2.77549 3.880338 0.662238
C  5.190264 5.24435 0.465904
C  2.948475 5.098335 1.303938
C  4.151168 5.785875 1.209832
H  -3.777205 -0.980518 -0.699637
H  -2.08045 -3.557256 -0.524272
H  -2.243425 -3.381886 2.535247
H  -3.34678 -4.142856 1.392513
H  -3.953697 -2.954411 2.540484
H  -1.473214 -0.91797 2.138735
H  -3.176159 -0.519344 2.346144
H  -2.317454 0.039054 0.920781
H  -4.460727 -3.904766 -1.051443
H  -6.663538 -4.600994 -1.228259
H  -7.794722 -3.280304 -1.532026
H  -7.680033 -3.971568 0.071579
H  -5.763814 -0.727182 0.454526
H  -7.194655 -1.600686 0.993095
H  -7.17372 -0.870888 -0.59633
H  0.836419 -1.175765 -2.675348
H  1.7564 -2.546446 -2.066378
H  2.329182 0.603666 -2.216948
H  1.313042 -2.114943 0.945886
H  2.5030 -0.674997 2.53971
H  3.64895 1.36506 1.792581
H  5.845628 3.595073 -0.750663
H  1.826895 3.362633 0.731047
H  6.132194 5.771201 0.383289
H  2.128623 5.514594 1.875256
H  4.275603 6.737646 1.709256
elementType: O C H
totalener: -1117.86968845 hartree
nucrepener: 2166.56835256 hartree
electener: -3284.43804100 hartree
oneelecener: -5822.88607058 hartree
twoeener: 2538.44802958 hartree
cpcmener: -0.02564032 hartree
kineticenergy: 1112.80324854 hartree
xcener: -110.226436346401 hartree
chargesum: 0.0000000
charge: -0.291816 -0.460974 -0.327323 0.143942 -0.012982 -0.110049 -0.269206 -0.294392 -0.257459 0.381672 -0.036036 -0.228316 -0.249762 0.102174 0.059948 -0.270884 -0.265619 0.286166 -0.118821 -0.211086 0.288235 -0.249910 -0.197095 -0.121811 -0.144829 -0.185644 0.099074 0.090870 0.098566 0.090971 0.096182 0.095372 0.098681 0.095978 0.119503 0.088525 0.094093 0.093526 0.087113 0.094064 0.100838 0.114675 0.121003 0.129500 0.143312 0.158292 0.154364 0.145589 0.157676 0.156810 0.159453 0.157849
qa: -0.2918 -0.4610 -0.3273 0.1439 -0.0130 -0.1100 -0.2692 -0.2944 -0.2575 0.3817 -0.0360 -0.2283 -0.2498 0.1022 0.0599 -0.2709 -0.2656 0.2862 -0.1188 -0.2111 0.2882 -0.2499 -0.1971 -0.1218 -0.1448 -0.1856 0.0991 0.0909 0.0986 0.0910 0.0962 0.0954 0.0987 0.0960 0.1195 0.0885 0.0941 0.0935 0.0871 0.0941 0.1008 0.1147 0.1210 0.1295 0.1433 0.1583 0.1544 0.1456 0.1577 0.1568 0.1595 0.1578
va: 2.1143 2.0451 2.0764 3.6699 3.8085 3.8536 3.9045 3.8956 3.8635 4.2130 3.7047 3.9280 3.9401 3.7917 3.6157 4.0855 3.9501 3.7321 3.8915 3.9297 3.6876 4.0079 3.9137 3.8853 3.8910 3.9045 1.0247 1.0379 1.0030 1.0027 1.0021 1.0025 1.0019 1.0181 1.0074 1.0078 0.9952 0.9966 1.0081 0.9983 0.9979 1.0116 0.9911 1.0203 1.0131 0.9905 0.9971 1.0084 0.9971 0.9895 0.9902 0.9906
dispcorr: -0.023900673 hartree
energy: -1117.893589118826
dipole: -34.15051 33.83317 -0.31734 -14.16373 13.41121 -0.75251 9.44744 -8.49902 0.94842
magnitude: 1.25159 au
magnitude: 3.18128 debye
