program: Orca
programVersion: 5.0.2
elementType: O O O C C C C C C C C C C C C C C C C C C C C C C C H H H H H H H H H H H H H H H H H H H H H H H H H H
charge: 0
multiplicity: 1
keywords: wb97x-d3
keywords: def2-TZVPP
keywords: def2/J RIJCOSX
keywords: DEFGRID2
keywords: scfconv7
keywords: smallprint printgap noloewdin
keywords: NOSOSCF
formula: C23H26O3
InChI: InChI=1/C23H26O3/c1-16(2)13-20-21(23(20,3)4)22(24)25-15-17-9-8-12-19(14-17)26-18-10-6-5-7-11-18/h5-14,20-21H,15H2,1-4H3
52 atoms
O  -0.081205 -0.779053 1.721612
O  -0.489026 -2.703291 0.659504
O  3.909193 1.69556 -0.804778
C  -2.486263 -0.82933 -0.897327
C  -3.230252 -1.753163 0.02142
C  -2.085331 -0.92701 0.567167
C  -3.127018 0.469811 -1.322397
C  -1.611949 -1.427858 -1.972577
C  -4.605249 -1.468925 0.482871
C  -0.827293 -1.584427 0.965679
C  -5.662874 -2.280503 0.379243
C  -7.006863 -1.858429 0.892512
C  -5.634682 -3.642728 -0.243891
C  1.230335 -1.227128 2.093625
C  2.196604 -1.034509 0.959618
C  2.589898 0.258344 0.623148
C  2.676809 -2.115165 0.229664
C  3.445931 0.462224 -0.449808
C  3.542736 -1.89963 -0.833749
C  3.923282 -0.615683 -1.185992
C  3.151619 2.814459 -0.582585
C  1.825575 2.891864 -0.991927
C  3.776332 3.901709 0.009254
C  1.125087 4.072793 -0.796037
C  3.066867 5.081619 0.187618
C  1.739773 5.17069 -0.207161
H  -2.989418 -2.80139 -0.121601
H  -2.355998 -0.064175 1.166728
H  -2.366103 1.179476 -1.654225
H  -3.694414 0.948217 -0.524746
H  -3.808906 0.302318 -2.159379
H  -0.758224 -0.781846 -2.190113
H  -2.187732 -1.529502 -2.894957
H  -1.229521 -2.414764 -1.721151
H  -4.760237 -0.499778 0.948962
H  -6.987579 -0.861148 1.332915
H  -7.375338 -2.554338 1.651665
H  -7.751504 -1.857269 0.091069
H  -6.299118 -3.680314 -1.111719
H  -6.003261 -4.39715 0.456164
H  -4.646734 -3.954236 -0.5773
H  1.208065 -2.264783 2.429305
H  1.501519 -0.604355 2.945388
H  2.231276 1.095996 1.21029
H  2.377954 -3.122335 0.489403
H  3.917232 -2.739817 -1.403983
H  4.593354 -0.445997 -2.019492
H  1.341343 2.04476 -1.46244
H  4.810764 3.827176 0.320806
H  0.092394 4.134339 -1.1147
H  3.555961 5.931904 0.645482
H  1.189066 6.090834 -0.062111
elementType: O C H
totalener: -1117.87046270 hartree
nucrepener: 2224.83333514 hartree
electener: -3342.70379783 hartree
oneelecener: -5939.20826815 hartree
twoeener: 2596.50447031 hartree
cpcmener: -0.02483835 hartree
kineticenergy: 1112.79802116 hartree
xcener: -110.224506892599 hartree
chargesum: -0.0000000
charge: -0.284784 -0.470218 -0.329306 0.108652 0.037282 -0.106205 -0.266794 -0.275140 -0.277903 0.396617 -0.046614 -0.219796 -0.249576 0.083013 -0.014308 -0.207183 -0.190009 0.272227 -0.124526 -0.244777 0.264999 -0.185368 -0.232862 -0.149317 -0.129064 -0.175734 0.090981 0.089339 0.096417 0.087727 0.097244 0.095930 0.096371 0.092915 0.117294 0.087642 0.093080 0.092523 0.096016 0.094139 0.089109 0.113697 0.123561 0.139852 0.138158 0.156918 0.146393 0.161636 0.145866 0.158615 0.157189 0.158082
qa: -0.2848 -0.4702 -0.3293 0.1087 0.0373 -0.1062 -0.2668 -0.2751 -0.2779 0.3966 -0.0466 -0.2198 -0.2496 0.0830 -0.0143 -0.2072 -0.1900 0.2722 -0.1245 -0.2448 0.2650 -0.1854 -0.2329 -0.1493 -0.1291 -0.1757 0.0910 0.0893 0.0964 0.0877 0.0972 0.0959 0.0964 0.0929 0.1173 0.0876 0.0931 0.0925 0.0960 0.0941 0.0891 0.1137 0.1236 0.1399 0.1382 0.1569 0.1464 0.1616 0.1459 0.1586 0.1572 0.1581
va: 2.1242 2.0375 2.0744 3.6927 3.7760 3.8499 3.9069 3.9015 3.8687 4.1962 3.7597 3.9225 3.9421 3.8172 3.6492 3.9358 3.9256 3.7278 3.9170 4.0024 3.7123 3.9187 4.0056 3.8944 3.8867 3.8999 1.0341 1.0364 1.0029 1.0056 1.0023 1.0005 1.0011 1.0197 1.0101 1.0089 0.9963 0.9963 0.9971 0.9973 1.0101 1.0099 0.9954 1.0115 1.0153 0.9896 1.0065 0.9929 1.0073 0.9907 0.9894 0.9904
dispcorr: -0.023871206 hartree
energy: -1117.894333903364
dipole: -33.59845 32.82867 -0.76978 -7.91936 8.79062 0.87127 -4.62585 4.79813 0.17229
magnitude: 1.17531 au
magnitude: 2.98740 debye
