program: Orca
programVersion: 5.0.2
elementType: O O O C C C C C C C C C C C C C C C C C C C C C C C H H H H H H H H H H H H H H H H H H H H H H H H H H
charge: 0
multiplicity: 1
keywords: wb97x-d3
keywords: def2-TZVPP
keywords: def2/J RIJCOSX
keywords: DEFGRID2
keywords: scfconv7
keywords: smallprint printgap noloewdin
keywords: NOSOSCF
formula: C23H26O3
InChI: InChI=1/C23H26O3/c1-16(2)13-20-21(23(20,3)4)22(24)25-15-17-9-8-12-19(14-17)26-18-10-6-5-7-11-18/h5-14,20-21H,15H2,1-4H3
52 atoms
O  -0.17896 -0.671446 1.626979
O  -0.566558 -2.703057 0.774238
O  4.011331 1.687508 -0.770317
C  -2.550803 -1.019265 -1.00315
C  -3.306932 -1.826822 0.010758
C  -2.161327 -0.946577 0.465233
C  -3.179302 0.224904 -1.582494
C  -1.675374 -1.746784 -1.993928
C  -4.683854 -1.485194 0.419793
C  -0.909804 -1.557856 0.952739
C  -5.730192 -2.316131 0.477024
C  -7.080504 -1.816014 0.896088
C  -5.688709 -3.774362 0.134084
C  1.120961 -1.06691 2.09108
C  2.136436 -0.936482 0.992237
C  2.586952 0.332944 0.63868
C  2.607334 -2.052184 0.310103
C  3.491595 0.480117 -0.40362
C  3.520655 -1.893667 -0.723206
C  3.959116 -0.632985 -1.092352
C  3.288176 2.837812 -0.600872
C  1.978553 2.95151 -1.052167
C  3.933855 3.917818 -0.017522
C  1.315218 4.16052 -0.905221
C  3.262016 5.125597 0.111824
C  1.950685 5.250615 -0.324358
H  -3.069342 -2.885169 -0.007298
H  -2.430639 -0.018444 0.958217
H  -2.411892 0.886154 -1.989558
H  -3.748228 0.797174 -0.851238
H  -3.856433 -0.03545 -2.398932
H  -0.807002 -1.144781 -2.270483
H  -2.242208 -1.940024 -2.906775
H  -1.315567 -2.706107 -1.629203
H  -4.853701 -0.447189 0.692365
H  -7.071867 -0.751375 1.13196
H  -7.445265 -2.352546 1.776372
H  -7.821366 -1.978483 0.107896
H  -4.695034 -4.143335 -0.113153
H  -6.338973 -3.984756 -0.719619
H  -6.069006 -4.375921 0.963778
H  1.09834 -2.077649 2.499486
H  1.342087 -0.379026 2.906176
H  2.235136 1.19701 1.190563
H  2.267253 -3.041929 0.58509
H  3.88902 -2.761033 -1.25551
H  4.667173 -0.50853 -1.90215
H  1.479499 2.110244 -1.517423
H  4.955964 3.814607 0.325167
H  0.295201 4.250183 -1.256243
H  3.768529 5.969461 0.562526
H  1.427893 6.191928 -0.21721
elementType: O C H
totalener: -1117.87049112 hartree
nucrepener: 2211.68906846 hartree
electener: -3329.55955958 hartree
oneelecener: -5912.90550841 hartree
twoeener: 2583.34594883 hartree
cpcmener: -0.02466929 hartree
kineticenergy: 1112.79714853 hartree
xcener: -110.224522364175 hartree
chargesum: -0.0000000
charge: -0.282897 -0.472589 -0.328955 0.103659 0.036174 -0.100924 -0.268828 -0.275272 -0.272943 0.400157 -0.051939 -0.217790 -0.250665 0.079398 -0.016957 -0.203429 -0.189636 0.272376 -0.125393 -0.243067 0.269719 -0.187702 -0.236202 -0.145013 -0.127274 -0.178139 0.091301 0.089717 0.097521 0.087434 0.096983 0.097551 0.096038 0.091664 0.116009 0.087275 0.093081 0.092307 0.089829 0.096493 0.094202 0.113849 0.122207 0.140010 0.139092 0.156581 0.146436 0.158413 0.145963 0.159106 0.157207 0.157862
qa: -0.2829 -0.4726 -0.3290 0.1037 0.0362 -0.1009 -0.2688 -0.2753 -0.2729 0.4002 -0.0519 -0.2178 -0.2507 0.0794 -0.0170 -0.2034 -0.1896 0.2724 -0.1254 -0.2431 0.2697 -0.1877 -0.2362 -0.1450 -0.1273 -0.1781 0.0913 0.0897 0.0975 0.0874 0.0970 0.0976 0.0960 0.0917 0.1160 0.0873 0.0931 0.0923 0.0898 0.0965 0.0942 0.1138 0.1222 0.1400 0.1391 0.1566 0.1464 0.1584 0.1460 0.1591 0.1572 0.1579
va: 2.1262 2.0351 2.0748 3.6928 3.7778 3.8397 3.9081 3.9027 3.8679 4.1928 3.7666 3.9213 3.9409 3.8181 3.6572 3.9390 3.9217 3.7304 3.9193 4.0018 3.7059 3.9212 4.0082 3.8897 3.8856 3.9013 1.0334 1.0358 1.0026 1.0062 1.0020 0.9998 1.0009 1.0198 1.0111 1.0090 0.9965 0.9960 1.0106 0.9969 0.9971 1.0105 0.9961 1.0102 1.0165 0.9898 1.0064 0.9954 1.0073 0.9904 0.9895 0.9904
dispcorr: -0.023472346 hartree
energy: -1117.893963465118
dipole: -33.97004 33.20970 -0.76034 -8.94664 9.84421 0.89757 -4.58377 4.67261 0.08884
magnitude: 1.17968 au
magnitude: 2.99851 debye
