program: Gaussian 09
title: 000071866
version: EM64L-G09RevD.01
frameworkgroup: C1[X(C26H27N7)]
method: RPBEPBE
basis: SDD
operation: Freq
keyword: #p
keyword: freq=noraman
keyword: PBEPBE/SDD
title: #p freq=noraman PBEPBE/SDD
converged: YES YES NO NO
title: Mulliken charges:
elementType: N N N N N N N C C C C C C C C C C C C C C C C C C C C C C C C C C H H H H H H H H H H H H H H H H H H H H H H H H H H H
charge: -0.198183 -0.471245 -0.671066 -0.200686 -0.099820 -0.678159 -0.625991 0.270977 0.085739 0.348555 0.268820 0.235230 -0.471187 0.210144 -0.371054 -0.573367 0.470801 -0.340643 -0.657279 -0.512317 0.570696 -0.465438 -0.349633 -0.309886 0.257999 -0.455047 -0.412755 0.460156 -0.464652 0.479548 0.228462 -0.780258 -0.664583 0.332008 0.250593 0.269536 0.238083 0.292491 0.275915 0.265350 0.252389 0.259241 0.271907 0.254755 0.349003 0.259279 0.253726 0.350398 0.341071 0.264467 0.272762 0.273181 0.272563 0.299353 0.272903 0.272605 0.339816 0.332098 0.371709 0.398923
chargesum: 2.00000
title: Mulliken charges with hydrogens summed into heavy atoms:
elementType: N N N N N N N C C C C C C C C C C C C C C C C C C C C C C C C C C
charge: -0.198183 -0.122242 0.020403 -0.200686 -0.099820 -0.006244 0.144641 0.270977 0.085739 0.348555 0.268820 0.235230 -0.139179 0.210144 -0.120462 -0.303832 0.470801 -0.102559 0.176476 -0.259928 0.570696 -0.206197 -0.077726 -0.055131 0.257999 -0.195767 -0.159029 0.460156 -0.200186 0.479548 0.228462 0.038248 0.180278
polarizability: 7.23023626e+02 -4.65336159e+01 4.11106430e+02 -1.29584174e+01 -1.11307199e+01 1.66688853e+02
1716.lowfreq: -8.1812 -2.8797 -0.0008 0.0004 0.0008 4.2309 18.5281 22.7465 33.3277
frequency: 18.4601 22.3497 33.3122 40.1737 52.7487 57.9541 68.0090 78.5671 101.1604 120.1085 134.8300 149.1281 165.5477 172.0286 192.0656 196.4906 219.1859 224.9969 231.9041 248.8464 255.5259 273.4209 281.9763 295.2883 333.8238 344.6437 357.9286 374.1958 376.0972 378.9204 388.6109 406.3231 417.3739 427.8764 435.4021 447.8500 450.8899 455.9651 472.0418 475.9131 494.7599 510.2820 526.3778 529.1130 555.7213 558.7458 564.6180 568.7643 576.3924 581.6439 599.9201 621.3201 628.7260 636.9348 653.2631 669.2276 674.7076 684.3185 685.1187 704.4771 713.8253 722.2998 729.3899 750.6759 754.7823 776.1005 781.5254 814.9938 834.2865 837.5916 838.7200 843.1337 849.8766 850.8917 857.1246 921.5917 938.5926 941.2540 961.9168 965.7990 969.3924 976.6461 981.8511 983.4018 987.3159 1000.4865 1026.0775 1028.8099 1031.8675 1047.7815 1056.2429 1103.3289 1114.0156 1118.4681 1119.3244 1133.0317 1140.9048 1147.5112 1163.3918 1176.6563 1195.4390 1199.2581 1221.9525 1241.3499 1247.0485 1267.3825 1282.4051 1306.5075 1312.4566 1331.7381 1334.8642 1347.3698 1361.5622 1369.2178 1376.4996 1387.7631 1402.4688 1406.4916 1415.0167 1436.9577 1441.7921 1445.4406 1449.9247 1460.9838 1463.3833 1474.5516 1475.8172 1482.7739 1484.7879 1486.6708 1498.0270 1498.5720 1517.0618 1521.7028 1535.1279 1549.7948 1553.3323 1560.3293 1569.8644 1588.4930 1624.5895 1627.6987 1634.9357 1645.5886 1651.0855 1659.0548 1664.8378 2992.5641 3000.7315 3018.6318 3071.6996 3086.6476 3110.2078 3123.3531 3128.3662 3128.9687 3131.5702 3150.4529 3150.7317 3155.5813 3168.1345 3170.9142 3176.3771 3182.5538 3184.6758 3188.0731 3222.0919 3486.4077 3520.0908 3535.7852 3540.0899 3664.0294 3668.3581 3673.3951
redmass: 4.9182 4.7426 4.0919 4.6669 3.7246 4.8451 3.8050 3.2271 3.4746 3.8083 5.1268 4.0881 1.4411 3.5061 4.1621 4.4307 3.8195 3.8921 4.1348 1.6573 1.5064 2.5316 2.1999 3.5812 3.5711 3.7808 3.6942 4.5197 3.5123 2.8544 3.1585 3.1557 2.8493 3.8697 5.4740 1.0596 2.2039 1.2124 1.1481 3.1249 4.0651 4.6319 3.8102 3.3269 5.0684 3.6622 1.3283 2.9064 1.2886 5.1666 3.9915 5.4721 4.8238 4.6667 1.6216 5.0006 1.4279 5.6460 2.7305 2.9097 4.8767 3.7230 3.7692 5.1812 4.8904 5.2315 2.7604 5.0782 1.4548 1.5017 1.7912 1.9282 1.5067 3.1572 1.9744 3.4280 2.0186 2.1516 1.7254 1.6765 1.4110 1.3596 1.3688 4.3422 3.6372 2.6597 2.1291 1.4542 1.9877 1.5587 1.4907 1.8063 2.1674 1.3748 1.3252 2.9357 1.2591 2.3948 3.5638 1.4253 1.8661 1.1299 1.7998 2.5634 1.4747 1.7056 1.7611 3.4180 1.4776 2.4153 3.1233 2.2360 2.6103 3.4903 3.6942 4.1555 2.7025 1.4563 1.4886 2.8674 3.8164 1.8926 1.5537 3.9263 1.0461 1.1971 3.4955 1.2064 1.0687 1.3389 3.2619 1.0402 4.6338 3.2319 3.2794 3.6231 5.5628 3.5706 5.8459 2.3307 3.9446 3.4865 4.8881 3.1351 2.3254 1.2383 1.3350 1.0403 1.0389 1.0368 1.0982 1.1041 1.1029 1.0971 1.0884 1.0911 1.0884 1.0899 1.0962 1.0978 1.0986 1.0954 1.0964 1.0945 1.0911 1.0927 1.0918 1.0529 1.0764 1.0463 1.0467 1.0991 1.1033 1.1039
irintensity: 1.9415 1.6001 0.8851 1.3613 0.1539 3.5442 0.5030 0.6748 3.4922 0.2399 3.8452 3.7491 6.2278 1.4430 0.7073 0.7814 4.9917 1.5496 0.2017 0.2301 2.0502 1.3469 0.0969 1.5335 0.1706 0.6698 2.4488 4.5473 0.6270 0.1601 3.5033 12.3469 5.3321 5.8795 2.5471 9.7291 11.6694 2.6959 50.9514 19.8855 0.7008 4.0123 31.5653 30.6223 20.5428 1.6109 216.9874 4.8580 284.5922 3.1450 1.2780 2.5127 8.6947 0.6067 30.2680 2.5335 137.1804 1.1122 1.0680 0.2526 18.5625 8.4340 8.2431 23.5373 1.9305 0.9933 0.1019 2.1112 46.3078 24.7091 36.7201 7.3401 52.7823 22.8906 87.9038 4.5992 9.3184 7.9786 3.4635 2.1166 0.1995 2.7703 0.6573 1.9680 8.0755 2.7605 1.0581 0.4385 8.0325 8.0069 3.1506 10.6449 1.7966 1.0573 0.1874 10.1471 14.8971 15.7253 31.7812 12.7938 1.2967 80.2628 10.3847 14.1189 9.2339 170.0555 29.1681 23.0330 8.8492 11.6717 159.9900 15.5891 46.5026 5.2226 8.5776 25.7742 18.6672 74.4238 2.5371 20.2858 10.6404 3.9255 65.5177 73.1119 42.7308 68.3022 74.2227 9.5873 12.4511 12.1831 253.1251 3.7310 364.6770 8.4262 407.9316 80.9976 4.1964 117.1747 6.5750 154.0658 291.7349 87.1074 976.1607 246.1341 229.0146 444.4904 370.0329 1.4029 10.5757 5.6093 1.4090 4.4616 3.4870 3.1341 4.4021 5.9987 3.9620 2.5584 5.5018 3.2132 1.3680 1.1342 1.5682 0.4723 3.6360 7.2591 7.7312 211.0243 55.8463 231.2061 391.2679 137.6890 35.7067 41.7107
temp: 298.150 k
press: 1.00000 atm
elementType: 7 7 7 7 7 7 7 6 6 6 6 6 6 6 6 6 6 6 6 6 6 6 6 6 6 6 6 6 6 6 6 6 6 1 1 1 1 1 1 1 1 1 1 1 1 1 1 1 1 1 1 1 1 1 1 1 1 1 1 1
symmnumber: 1
zpe: 1290972.2 jmol-1
zpe.correction: 0.491705 hartree
zpe.thermalcorrener: 0.520704 hartree
zpe.thermalcorrenthalpy: 0.521649 hartree
zpe.thermalcorrgfe: 0.432243 hartree
zpe.sumelectzpe: -1387.512178 hartree
zpe.sumelectthermal: -1387.483179 hartree
zpe.sumelectthermalent: -1387.482235 hartree
zpe.sumelectthermalfe: -1387.571640 hartree
dipole: -6.3525 1.3501 -0.6761
dipole: 6.5295
quadrupole: 92.1678 -83.4735 -188.4408
quadrupole: -1.0240 -2.9805 -2.1042
quadrupole: 152.0833 -23.5580 -128.5253 -1.0240 -2.9805 -2.1042
hfenergy: -1388.0038832 hartree
pointgroup: C01 [X(C26H27N7)]
dipole: -2.5092399 -0.5017072 0.2264224 debye
polarizability: 722.4252339|46.5260329|408.3125284|25.8824778|-25.0712151|170.0811468 unknown
InChI: InChI=1S/C26H27N7/c1-15-12-24(31-26(29)32(15)2)30-19-9-11-20-21-10-8-18(28)13-23(21)33(3)25(22(20)14-19)16-4-6-17(27)7-5-16/h4-14,30H,27-29H2,1-3H3
charge 2 multiplicity 1
60 atoms
N  2.971817 -1.127656 0.047573
N  -1.984956 2.580825 -0.361659
N  7.666171 0.210656 0.48117
N  -5.518701 0.420214 -0.083828
N  -3.101538 0.496243 -0.193256
N  -2.196992 -5.121423 0.083274
N  -4.172801 -1.550316 -0.03397
C  1.204208 0.534572 -0.173228
C  1.629048 -0.838791 -0.044856
C  2.189013 1.589351 -0.237914
C  3.584824 1.259102 -0.092062
C  3.978804 -0.115714 0.090032
C  -0.193964 0.842304 -0.201779
C  0.63809 -1.946556 -0.007643
C  1.714939 2.930865 -0.405251
C  5.332854 -0.467862 0.284721
C  -0.620539 2.168024 -0.343583
C  4.626807 2.241771 -0.094941
C  3.442843 -2.54388 0.02669
C  0.35541 3.214221 -0.464303
C  6.343749 0.530682 0.286961
C  5.960504 1.903368 0.082443
C  -0.204613 -2.205719 -1.124602
C  0.483337 -2.761296 1.152759
C  -3.148438 1.856568 -0.278674
C  -1.140337 -3.254972 -1.102988
C  -0.463198 -3.794581 1.196905
C  -1.282368 -4.080572 0.057915
C  -4.410687 2.548656 -0.279339
C  -5.591863 1.827321 -0.177956
C  -4.25883 -0.192822 -0.10398
C  -6.937698 2.500679 -0.164833
C  -6.731668 -0.432121 0.027883
H  -0.931994 0.050425 -0.099557
H  2.421335 3.760034 -0.482347
H  5.630688 -1.504282 0.451491
H  4.376639 3.296129 -0.234621
H  2.608026 -3.206035 -0.227005
H  4.228132 -2.647836 -0.738743
H  3.845054 -2.83446 1.011657
H  0.030301 4.254826 -0.588618
H  6.730142 2.68244 0.075273
H  -0.100253 -1.605176 -2.035084
H  1.100207 -2.571256 2.03887
H  -2.114372 3.594086 -0.435319
H  -1.728209 -3.47168 -2.002741
H  -0.562983 -4.399701 2.104819
H  8.385688 0.93165 0.484709
H  7.970304 -0.75033 0.626688
H  -4.460651 3.637117 -0.351054
H  -7.49111 2.306544 0.772481
H  -6.808724 3.589766 -0.249988
H  -7.573308 2.17669 -1.009404
H  -7.632812 0.190358 0.038755
H  -6.801872 -1.114356 -0.838025
H  -6.709455 -1.008803 0.969721
H  -2.24344 -5.75001 0.883758
H  -2.651777 -5.435378 -0.772571
H  -4.975473 -2.167304 0.062167
H  -3.235511 -1.960396 -0.076991
