program: Orca
programVersion: 5.0.2
elementType: O O O C C C C C C C C C C C C C C C C C C C C C C C H H H H H H H H H H H H H H H H H H H H H H H H H H
charge: 0
multiplicity: 1
keywords: wb97x-d3
keywords: def2-TZVPP
keywords: def2/J RIJCOSX
keywords: DEFGRID2
keywords: scfconv7
keywords: smallprint printgap noloewdin
keywords: NOSOSCF
formula: C23H26O3
InChI: InChI=1/C23H26O3/c1-16(2)13-20-21(23(20,3)4)22(24)25-15-17-9-8-12-19(14-17)26-18-10-6-5-7-11-18/h5-14,20-21H,15H2,1-4H3
52 atoms
O  0.676107 -2.078718 -1.522657
O  0.117038 -2.942696 0.45941
O  2.655166 2.192221 0.512235
C  -2.817074 -2.515219 -0.56855
C  -2.417123 -1.385005 0.324065
C  -1.519882 -1.78076 -0.847031
C  -3.904201 -2.312952 -1.597495
C  -2.802964 -3.914918 -0.003766
C  -3.091447 -0.073521 0.332687
C  -0.192312 -2.341547 -0.541913
C  -3.047868 0.829472 1.319712
C  -3.821111 2.11078 1.223627
C  -2.257329 0.679625 2.58437
C  2.05596 -2.351616 -1.263716
C  2.604828 -1.406284 -0.230844
C  2.381644 -0.040461 -0.379951
C  3.304547 -1.877748 0.871193
C  2.827386 0.841022 0.593823
C  3.77918 -0.982438 1.820651
C  3.532836 0.374477 1.69769
C  1.599702 2.738846 -0.166231
C  0.307475 2.232647 -0.079012
C  1.86203 3.880992 -0.910644
C  -0.715803 2.871675 -0.7642
C  0.824563 4.52066 -1.573397
C  -0.466084 4.015036 -1.511325
H  -2.023658 -1.708682 1.281303
H  -1.540056 -1.12309 -1.708924
H  -3.839439 -3.082444 -2.369042
H  -3.84503 -1.34825 -2.10002
H  -4.891367 -2.389857 -1.137571
H  -3.795967 -4.165114 0.37426
H  -2.102386 -4.039196 0.818109
H  -2.552675 -4.646961 -0.774406
H  -3.685082 0.170797 -0.543398
H  -4.372854 2.193995 0.287215
H  -3.161469 2.978349 1.307207
H  -4.540295 2.193138 2.043605
H  -1.624844 -0.205356 2.609544
H  -2.918933 0.642106 3.454061
H  -1.610638 1.548438 2.730569
H  2.548241 -2.208647 -2.225562
H  2.203103 -3.390984 -0.96527
H  1.851972 0.324982 -1.251275
H  3.470104 -2.94077 0.993863
H  4.325077 -1.347124 2.681159
H  3.882699 1.072241 2.448306
H  0.092261 1.348881 0.509268
H  2.872544 4.2669 -0.963622
H  -1.717845 2.466768 -0.708309
H  1.032549 5.413476 -2.148882
H  -1.272471 4.507945 -2.038213
elementType: O C H
totalener: -1117.86913619 hartree
nucrepener: 2340.57230429 hartree
electener: -3458.44144048 hartree
oneelecener: -6170.65746029 hartree
twoeener: 2712.21601981 hartree
cpcmener: -0.02425278 hartree
kineticenergy: 1112.80863746 hartree
xcener: -110.230938144058 hartree
chargesum: -0.0000000
charge: -0.292183 -0.468786 -0.326506 0.106105 0.036225 -0.064786 -0.287669 -0.273876 -0.265630 0.374311 -0.070369 -0.237567 -0.268796 0.098634 0.031009 -0.270021 -0.225078 0.317844 -0.100860 -0.271370 0.310610 -0.219202 -0.260334 -0.125473 -0.109521 -0.210663 0.098474 0.090030 0.097542 0.089821 0.102163 0.094928 0.092531 0.096762 0.117691 0.093986 0.091285 0.105566 0.093830 0.110098 0.092885 0.123081 0.111646 0.140778 0.140927 0.157135 0.145041 0.160840 0.143999 0.171036 0.157015 0.154863
qa: -0.2922 -0.4688 -0.3265 0.1061 0.0362 -0.0648 -0.2877 -0.2739 -0.2656 0.3743 -0.0704 -0.2376 -0.2688 0.0986 0.0310 -0.2700 -0.2251 0.3178 -0.1009 -0.2714 0.3106 -0.2192 -0.2603 -0.1255 -0.1095 -0.2107 0.0985 0.0900 0.0975 0.0898 0.1022 0.0949 0.0925 0.0968 0.1177 0.0940 0.0913 0.1056 0.0938 0.1101 0.0929 0.1231 0.1116 0.1408 0.1409 0.1571 0.1450 0.1608 0.1440 0.1710 0.1570 0.1549
va: 2.1077 2.0379 2.0924 3.7728 3.7525 3.7676 3.9141 3.8943 3.8490 4.1888 3.7284 3.9125 3.9275 3.8090 3.6312 3.9329 3.9635 3.6985 3.8846 4.0129 3.7222 3.9204 4.0145 3.8208 3.8781 3.9710 1.0238 1.0347 1.0016 1.0055 0.9998 0.9998 1.0206 0.9999 1.0111 1.0060 0.9963 0.9982 1.0108 0.9989 0.9969 0.9934 1.0095 1.0148 1.0048 0.9887 1.0080 0.9838 1.0088 0.9843 0.9884 0.9942
dispcorr: -0.027619862 hartree
energy: -1117.896756054273
dipole: -25.76434 25.07161 -0.69273 -3.34035 3.68761 0.34726 2.59035 -3.36464 -0.77429
magnitude: 1.09544 au
magnitude: 2.78438 debye
