program: Orca
programVersion: 5.0.2
elementType: O O O C C C C C C C C C C C C C C C C C C C C C C C H H H H H H H H H H H H H H H H H H H H H H H H H H
charge: 0
multiplicity: 1
keywords: wb97x-d3
keywords: def2-TZVPP
keywords: def2/J RIJCOSX
keywords: DEFGRID2
keywords: scfconv7
keywords: smallprint printgap noloewdin
keywords: NOSOSCF
formula: C23H26O3
InChI: InChI=1/C23H26O3/c1-16(2)13-20-21(23(20,3)4)22(24)25-15-17-9-8-12-19(14-17)26-18-10-6-5-7-11-18/h5-14,20-21H,15H2,1-4H3
52 atoms
O  0.649811 -2.08237 -1.46978
O  0.166592 -2.809975 0.586266
O  2.74749 2.210301 0.451528
C  -2.801483 -2.584134 -0.428556
C  -2.447474 -1.374007 0.376458
C  -1.538909 -1.812216 -0.767288
C  -3.900287 -2.506208 -1.462039
C  -2.729152 -3.934689 0.241575
C  -3.179357 -0.097308 0.282573
C  -0.184927 -2.299162 -0.450766
C  -3.306265 0.822682 1.246402
C  -4.117195 2.062154 1.013937
C  -2.687927 0.732789 2.609131
C  2.038395 -2.351322 -1.254188
C  2.645301 -1.391343 -0.269072
C  2.404642 -0.026842 -0.406237
C  3.438922 -1.854008 0.771346
C  2.930912 0.860809 0.521457
C  3.991095 -0.952186 1.671194
C  3.732389 0.403373 1.561534
C  1.660641 2.74975 -0.182065
C  1.895018 3.825046 -1.026696
C  0.365826 2.299229 0.050366
C  0.825043 4.45615 -1.645414
C  -0.69229 2.929476 -0.587941
C  -0.470868 4.00754 -1.435199
H  -2.044421 -1.609971 1.355204
H  -1.602286 -1.220961 -1.673968
H  -4.880996 -2.598752 -0.990839
H  -3.801022 -3.322861 -2.179978
H  -3.889787 -1.576621 -2.029774
H  -2.463369 -4.715729 -0.473883
H  -3.708799 -4.188127 0.65243
H  -2.015142 -3.972636 1.061184
H  -3.666915 0.106693 -0.666027
H  -4.531567 2.102552 0.006353
H  -3.517223 2.962915 1.169692
H  -4.949678 2.124181 1.720886
H  -2.00274 -0.104036 2.72882
H  -3.459089 0.645099 3.379205
H  -2.132381 1.646789 2.833721
H  2.491738 -2.235349 -2.239118
H  2.19141 -3.385274 -0.938457
H  1.802922 0.334025 -1.231604
H  3.619588 -2.915602 0.885244
H  4.611291 -1.30999 2.48284
H  4.145516 1.10521 2.275179
H  2.908591 4.167892 -1.193467
H  0.175911 1.467594 0.71834
H  1.011436 5.296578 -2.301479
H  -1.699233 2.571518 -0.416589
H  -1.303628 4.494162 -1.925734
elementType: O C H
totalener: -1117.86972178 hartree
nucrepener: 2324.73169651 hartree
electener: -3442.60141829 hartree
oneelecener: -6139.06069206 hartree
twoeener: 2696.45927377 hartree
cpcmener: -0.02494635 hartree
kineticenergy: 1112.79929236 hartree
xcener: -110.228548988185 hartree
chargesum: 0.0000000
charge: -0.291845 -0.468688 -0.327257 0.098380 0.049401 -0.078293 -0.279849 -0.273925 -0.278608 0.382862 -0.065624 -0.228867 -0.265638 0.100023 0.030946 -0.264287 -0.228667 0.313660 -0.101310 -0.271346 0.313371 -0.259771 -0.249174 -0.101145 -0.085445 -0.229244 0.097927 0.088532 0.099923 0.096998 0.089480 0.097110 0.095344 0.092009 0.115909 0.093485 0.088401 0.106791 0.093740 0.107659 0.092597 0.122607 0.112951 0.139630 0.140275 0.156994 0.145126 0.144890 0.160676 0.157092 0.170778 0.153416
qa: -0.2918 -0.4687 -0.3273 0.0984 0.0494 -0.0783 -0.2798 -0.2739 -0.2786 0.3829 -0.0656 -0.2289 -0.2656 0.1000 0.0309 -0.2643 -0.2287 0.3137 -0.1013 -0.2713 0.3134 -0.2598 -0.2492 -0.1011 -0.0854 -0.2292 0.0979 0.0885 0.0999 0.0970 0.0895 0.0971 0.0953 0.0920 0.1159 0.0935 0.0884 0.1068 0.0937 0.1077 0.0926 0.1226 0.1130 0.1396 0.1403 0.1570 0.1451 0.1449 0.1607 0.1571 0.1708 0.1534
va: 2.1101 2.0388 2.0891 3.7502 3.7505 3.7770 3.9127 3.8988 3.8628 4.1841 3.7494 3.9047 3.9320 3.8037 3.6414 3.9275 3.9659 3.7059 3.8880 4.0110 3.7041 4.0222 3.9604 3.8662 3.7902 3.9840 1.0244 1.0353 1.0005 1.0017 1.0070 0.9999 0.9995 1.0206 1.0123 1.0065 0.9976 0.9969 1.0103 0.9975 0.9973 0.9925 1.0085 1.0169 1.0045 0.9887 1.0081 1.0082 0.9922 0.9887 0.9782 0.9960
dispcorr: -0.026867568 hartree
energy: -1117.896589348630
dipole: -27.05796 26.27534 -0.78262 -3.95381 4.20347 0.24966 2.72574 -3.56610 -0.84036
magnitude: 1.17517 au
magnitude: 2.98704 debye
