program: Orca
programVersion: 5.0.2
elementType: O O O C C C C C C C C C C C C C C C C C C C C C C C H H H H H H H H H H H H H H H H H H H H H H H H H H
charge: 0
multiplicity: 1
keywords: wb97x-d3
keywords: def2-TZVPP
keywords: def2/J RIJCOSX
keywords: DEFGRID2
keywords: scfconv7
keywords: smallprint printgap noloewdin
keywords: NOSOSCF
formula: C23H26O3
InChI: InChI=1/C23H26O3/c1-16(2)13-20-21(23(20,3)4)22(24)25-15-17-9-8-12-19(14-17)26-18-10-6-5-7-11-18/h5-14,20-21H,15H2,1-4H3
52 atoms
O  -0.28309 -2.190493 -1.189597
O  -1.591737 -0.384023 -1.067615
O  2.846636 2.824606 -0.562848
C  -2.958616 -2.276143 1.098765
C  -3.837058 -2.0991 -0.105723
C  -2.392905 -2.506182 -0.293663
C  -3.108239 -3.506105 1.960546
C  -2.569365 -1.048612 1.885393
C  -4.90411 -3.057518 -0.459761
C  -1.422441 -1.565047 -0.883296
C  -6.175707 -2.76116 -0.74781
C  -7.150928 -3.840021 -1.113418
C  -6.750403 -1.376911 -0.75332
C  0.788055 -1.398456 -1.696763
C  1.379733 -0.487316 -0.656556
C  1.858269 0.757044 -1.043422
C  1.501869 -0.886976 0.671189
C  2.448031 1.599558 -0.111113
C  2.075582 -0.028534 1.597086
C  2.550802 1.219257 1.220658
C  3.946442 3.437576 -0.027879
C  3.855883 4.799932 0.218824
C  5.133617 2.752375 0.202059
C  4.96533 5.482598 0.69751
C  6.230667 3.445405 0.692395
C  6.153826 4.809381 0.942243
H  -4.037744 -1.061749 -0.351421
H  -2.210143 -3.54748 -0.53781
H  -3.921273 -3.375763 2.678173
H  -2.193655 -3.686754 2.528958
H  -3.317046 -4.407227 1.385104
H  -3.28647 -0.889629 2.693441
H  -2.552176 -0.140666 1.28588
H  -1.584394 -1.169002 2.342046
H  -4.611998 -4.103374 -0.494716
H  -6.689019 -4.827313 -1.131155
H  -7.589231 -3.657021 -2.098484
H  -7.985472 -3.871439 -0.407507
H  -7.674535 -1.343716 -0.171156
H  -7.01845 -1.073518 -1.769139
H  -6.081865 -0.619801 -0.348191
H  0.46929 -0.831533 -2.57438
H  1.530667 -2.125022 -2.028958
H  1.765857 1.082781 -2.073238
H  1.147435 -1.858239 0.992367
H  2.154782 -0.33226 2.632984
H  2.98508 1.879955 1.960003
H  2.925234 5.3209 0.031007
H  5.21023 1.691563 -0.001894
H  4.8931 6.545944 0.886317
H  7.154989 2.911763 0.872912
H  7.015205 5.343044 1.321744
elementType: O C H
totalener: -1117.87050836 hartree
nucrepener: 2153.81171200 hartree
electener: -3271.68222037 hartree
oneelecener: -5797.44680175 hartree
twoeener: 2525.76458138 hartree
cpcmener: -0.02670930 hartree
kineticenergy: 1112.80074367 hartree
xcener: -110.227162544624 hartree
chargesum: -0.0000000
charge: -0.289205 -0.458884 -0.327981 0.111231 0.041501 -0.096742 -0.268331 -0.274377 -0.283010 0.373754 -0.039857 -0.220423 -0.256207 0.098887 0.066851 -0.271167 -0.270325 0.277893 -0.119388 -0.204584 0.275065 -0.241449 -0.186133 -0.126152 -0.148357 -0.181093 0.089472 0.090030 0.097444 0.097057 0.087610 0.099974 0.093750 0.091141 0.116241 0.087471 0.092662 0.093380 0.092774 0.099080 0.091309 0.115283 0.120515 0.129365 0.142990 0.158309 0.155583 0.145996 0.156648 0.157332 0.159022 0.158046
qa: -0.2892 -0.4589 -0.3280 0.1112 0.0415 -0.0967 -0.2683 -0.2744 -0.2830 0.3738 -0.0399 -0.2204 -0.2562 0.0989 0.0669 -0.2712 -0.2703 0.2779 -0.1194 -0.2046 0.2751 -0.2414 -0.1861 -0.1262 -0.1484 -0.1811 0.0895 0.0900 0.0974 0.0971 0.0876 0.1000 0.0938 0.0911 0.1162 0.0875 0.0927 0.0934 0.0928 0.0991 0.0913 0.1153 0.1205 0.1294 0.1430 0.1583 0.1556 0.1460 0.1566 0.1573 0.1590 0.1580
va: 2.1139 2.0469 2.0730 3.6934 3.7860 3.8211 3.9058 3.8996 3.8823 4.2156 3.7476 3.9235 3.9428 3.7932 3.6120 4.0868 3.9509 3.7328 3.8926 3.9247 3.6977 4.0048 3.9103 3.8878 3.8938 3.9008 1.0349 1.0370 1.0022 1.0024 1.0058 1.0015 1.0177 1.0028 1.0109 1.0090 0.9955 0.9965 0.9980 0.9957 1.0085 1.0106 0.9915 1.0204 1.0130 0.9909 0.9970 1.0079 0.9967 0.9894 0.9904 0.9904
dispcorr: -0.023425050 hartree
energy: -1117.893933414089
dipole: -31.50084 31.84534 0.34449 -17.25063 16.22701 -1.02362 6.96143 -6.28406 0.67737
magnitude: 1.27488 au
magnitude: 3.24048 debye
