program: Orca
programVersion: 5.0.2
elementType: O O O C C C C C C C C C C C C C C C C C C C C C C C H H H H H H H H H H H H H H H H H H H H H H H H H H
charge: 0
multiplicity: 1
keywords: wb97x-d3
keywords: def2-TZVPP
keywords: def2/J RIJCOSX
keywords: DEFGRID2
keywords: scfconv7
keywords: smallprint printgap noloewdin
keywords: NOSOSCF
formula: C23H26O3
InChI: InChI=1/C23H26O3/c1-16(2)13-20-21(23(20,3)4)22(24)25-15-17-9-8-12-19(14-17)26-18-10-6-5-7-11-18/h5-14,20-21H,15H2,1-4H3
52 atoms
O  -0.245552 -2.218817 -1.188673
O  -1.563344 -0.41762 -1.278303
O  2.979673 2.760994 -0.663875
C  -3.051863 -2.096103 0.958773
C  -3.848771 -2.097208 -0.312676
C  -2.388939 -2.472101 -0.358923
C  -3.250189 -3.22178 1.943079
C  -2.744157 -0.776705 1.622292
C  -4.862352 -3.14108 -0.604233
C  -1.399876 -1.57785 -0.986909
C  -6.186241 -2.969728 -0.554449
C  -7.125114 -4.085802 -0.896665
C  -6.846409 -1.68073 -0.171914
C  0.856198 -1.457575 -1.675528
C  1.389467 -0.493242 -0.651309
C  1.956982 0.698987 -1.080565
C  1.369143 -0.792057 0.707852
C  2.48923 1.591195 -0.160028
C  1.885867 0.116811 1.619286
C  2.4452 1.315033 1.200459
C  4.038023 3.394989 -0.074302
C  3.991834 4.781288 -0.028506
C  5.149358 2.707135 0.399192
C  5.068195 5.484193 0.493615
C  6.212439 3.423212 0.930283
C  6.179305 4.81065 0.98086
H  -4.071863 -1.106247 -0.697475
H  -2.167274 -3.529115 -0.464691
H  -4.120926 -3.025863 2.573663
H  -2.382276 -3.317896 2.598944
H  -3.406603 -4.18579 1.458636
H  -3.514661 -0.553064 2.363945
H  -2.713952 0.06005 0.926356
H  -1.786378 -0.812119 2.147531
H  -4.483694 -4.12073 -0.882639
H  -6.598705 -4.994485 -1.189437
H  -7.789185 -3.803147 -1.718354
H  -7.772094 -4.329552 -0.049499
H  -7.377598 -1.245906 -1.023505
H  -6.150484 -0.932263 0.20409
H  -7.598579 -1.850226 0.602982
H  0.593399 -0.936743 -2.599504
H  1.614493 -2.201304 -1.925656
H  1.978247 0.945758 -2.136042
H  0.945999 -1.721939 1.065887
H  1.852174 -0.10735 2.677737
H  2.831584 2.016181 1.928894
H  3.12204 5.304474 -0.405725
H  5.19599 1.62626 0.35377
H  5.031388 6.565565 0.524116
H  7.076756 2.887061 1.300936
H  7.014284 5.361592 1.39329
elementType: O C H
totalener: -1117.86962279 hartree
nucrepener: 2155.13728679 hartree
electener: -3273.00690959 hartree
oneelecener: -5800.04708767 hartree
twoeener: 2527.04017808 hartree
cpcmener: -0.02627353 hartree
kineticenergy: 1112.79693813 hartree
xcener: -110.225927979286 hartree
chargesum: -0.0000000
charge: -0.291340 -0.458726 -0.326115 0.148569 -0.003089 -0.112512 -0.265811 -0.291170 -0.269257 0.374726 -0.030349 -0.227705 -0.253751 0.098457 0.070783 -0.282046 -0.271124 0.295845 -0.116497 -0.216747 0.293166 -0.250755 -0.201485 -0.121333 -0.143544 -0.186862 0.098181 0.090689 0.095411 0.097751 0.090244 0.098993 0.097016 0.092670 0.119089 0.088218 0.093934 0.093788 0.100511 0.088590 0.093294 0.115403 0.121378 0.129024 0.144028 0.158245 0.155074 0.145752 0.156495 0.157647 0.159379 0.157870
qa: -0.2913 -0.4587 -0.3261 0.1486 -0.0031 -0.1125 -0.2658 -0.2912 -0.2693 0.3747 -0.0303 -0.2277 -0.2538 0.0985 0.0708 -0.2820 -0.2711 0.2958 -0.1165 -0.2167 0.2932 -0.2508 -0.2015 -0.1213 -0.1435 -0.1869 0.0982 0.0907 0.0954 0.0978 0.0902 0.0990 0.0970 0.0927 0.1191 0.0882 0.0939 0.0938 0.1005 0.0886 0.0933 0.1154 0.1214 0.1290 0.1440 0.1582 0.1551 0.1458 0.1565 0.1576 0.1594 0.1579
va: 2.1122 2.0464 2.0779 3.6660 3.7970 3.8613 3.9039 3.8944 3.8751 4.2137 3.7033 3.9276 3.9438 3.7931 3.6099 4.0953 3.9524 3.7188 3.8894 3.9335 3.6839 4.0091 3.9147 3.8841 3.8905 3.9063 1.0251 1.0387 1.0032 1.0031 1.0027 1.0025 1.0175 1.0029 1.0077 1.0085 0.9946 0.9965 0.9969 1.0073 0.9985 1.0108 0.9912 1.0207 1.0125 0.9910 0.9971 1.0084 0.9972 0.9892 0.9901 0.9906
dispcorr: -0.023860390 hartree
energy: -1117.893483182109
dipole: -32.49706 32.70998 0.21292 -16.98908 16.00658 -0.98250 8.51844 -7.62581 0.89263
magnitude: 1.34441 au
magnitude: 3.41722 debye
