program: Orca
programVersion: 5.0.2
elementType: O O O C C C C C C C C C C C C C C C C C C C C C C C H H H H H H H H H H H H H H H H H H H H H H H H H H
charge: 0
multiplicity: 1
keywords: wb97x-d3
keywords: def2-TZVPP
keywords: def2/J RIJCOSX
keywords: DEFGRID2
keywords: scfconv7
keywords: smallprint printgap noloewdin
keywords: NOSOSCF
formula: C23H26O3
InChI: InChI=1/C23H26O3/c1-16(2)13-20-21(23(20,3)4)22(24)25-15-17-9-8-12-19(14-17)26-18-10-6-5-7-11-18/h5-14,20-21H,15H2,1-4H3
52 atoms
O  -0.0646 -1.693958 -1.705532
O  -1.028349 0.086457 -0.757689
O  3.226675 1.815571 1.407461
C  -2.478077 -2.20685 0.846207
C  -3.419438 -1.580998 -0.139531
C  -2.070686 -2.063161 -0.613238
C  -2.748252 -3.615486 1.314588
C  -1.854413 -1.337236 1.909514
C  -4.644155 -2.275273 -0.605599
C  -1.033558 -1.094379 -1.014415
C  -5.891136 -1.976049 -0.231101
C  -7.065597 -2.736328 -0.76801
C  -6.235895 -0.889382 0.740231
C  1.074793 -0.910683 -2.085592
C  2.02284 -0.741808 -0.932627
C  2.182974 0.498111 -0.327155
C  2.728738 -1.842576 -0.453401
C  3.06158 0.635408 0.74126
C  3.589368 -1.696805 0.622611
C  3.765982 -0.458505 1.222334
C  3.179486 3.007125 0.73671
C  3.821459 3.197537 -0.480838
C  2.511989 4.054162 1.355003
C  3.776674 4.447474 -1.081049
C  2.487184 5.302393 0.749327
C  3.112296 5.503687 -0.47268
H  -3.49954 -0.501814 -0.049552
H  -2.057486 -2.993904 -1.170633
H  -3.485916 -3.614505 2.120084
H  -1.836658 -4.073973 1.70256
H  -3.129098 -4.258498 0.521762
H  -0.859356 -1.696373 2.180741
H  -2.469452 -1.368035 2.811345
H  -1.765116 -0.293687 1.615785
H  -4.503392 -3.095789 -1.303686
H  -7.627964 -3.211981 0.039881
H  -6.767594 -3.51303 -1.472326
H  -7.766231 -2.070372 -1.278957
H  -6.88877 -0.14474 0.278024
H  -5.367406 -0.369521 1.139356
H  -6.792405 -1.297785 1.58758
H  0.767293 0.051716 -2.497254
H  1.54341 -1.481674 -2.886278
H  1.619307 1.348498 -0.691014
H  2.609891 -2.811179 -0.923667
H  4.141474 -2.55038 0.994063
H  4.444655 -0.340057 2.057734
H  4.354347 2.38596 -0.959815
H  2.020023 3.892634 2.30575
H  4.273725 4.594776 -2.03092
H  1.967864 6.117945 1.235132
H  3.085564 6.476016 -0.946629
elementType: O C H
totalener: -1117.86977526 hartree
nucrepener: 2198.17702055 hartree
electener: -3316.04679581 hartree
oneelecener: -5886.37796365 hartree
twoeener: 2570.33116784 hartree
cpcmener: -0.02474077 hartree
kineticenergy: 1112.82085656 hartree
xcener: -110.228249951678 hartree
chargesum: -0.0000000
charge: -0.284602 -0.470918 -0.329491 0.147871 -0.002762 -0.130221 -0.265234 -0.292164 -0.268864 0.405758 -0.031100 -0.227636 -0.250983 0.083917 -0.014223 -0.151617 -0.237572 0.262311 -0.115857 -0.249862 0.284220 -0.192714 -0.247205 -0.142612 -0.121124 -0.185741 0.095986 0.089974 0.095670 0.097892 0.089516 0.099064 0.095292 0.093778 0.119698 0.093279 0.088010 0.094134 0.097611 0.087929 0.094984 0.112983 0.126827 0.136150 0.142487 0.157702 0.146276 0.154611 0.145789 0.158893 0.156549 0.157339
qa: -0.2846 -0.4709 -0.3295 0.1479 -0.0028 -0.1302 -0.2652 -0.2922 -0.2689 0.4058 -0.0311 -0.2276 -0.2510 0.0839 -0.0142 -0.1516 -0.2376 0.2623 -0.1159 -0.2499 0.2842 -0.1927 -0.2472 -0.1426 -0.1211 -0.1857 0.0960 0.0900 0.0957 0.0979 0.0895 0.0991 0.0953 0.0938 0.1197 0.0933 0.0880 0.0941 0.0976 0.0879 0.0950 0.1130 0.1268 0.1361 0.1425 0.1577 0.1463 0.1546 0.1458 0.1589 0.1565 0.1573
va: 2.1258 2.0375 2.0765 3.6734 3.7796 3.8881 3.9041 3.9020 3.8725 4.1937 3.7099 3.9275 3.9437 3.8098 3.6427 3.8676 3.9737 3.7478 3.8924 4.0175 3.6976 3.9125 4.0098 3.8887 3.8843 3.9060 1.0273 1.0378 1.0031 1.0029 1.0031 0.9992 1.0015 1.0188 1.0078 0.9964 1.0082 0.9954 0.9980 1.0085 0.9976 1.0103 0.9931 1.0231 1.0056 0.9887 1.0066 0.9979 1.0081 0.9903 0.9896 0.9907
dispcorr: -0.023643668 hartree
energy: -1117.893418925614
dipole: -31.74198 31.60094 -0.14104 -14.11304 13.28262 -0.83042 4.09795 -4.49961 -0.40166
magnitude: 0.93318 au
magnitude: 2.37194 debye
