program: Orca
programVersion: 5.0.2
elementType: O O O C C C C C C C C C C C C C C C C C C C C C C C H H H H H H H H H H H H H H H H H H H H H H H H H H
charge: 0
multiplicity: 1
keywords: wb97x-d3
keywords: def2-TZVPP
keywords: def2/J RIJCOSX
keywords: DEFGRID2
keywords: scfconv7
keywords: smallprint printgap noloewdin
keywords: NOSOSCF
formula: C23H26O3
InChI: InChI=1/C23H26O3/c1-16(2)13-20-21(23(20,3)4)22(24)25-15-17-9-8-12-19(14-17)26-18-10-6-5-7-11-18/h5-14,20-21H,15H2,1-4H3
52 atoms
O  -0.491085 -2.109746 -1.222051
O  -1.524901 -0.170367 -0.819861
O  3.584073 2.222162 -0.756483
C  -2.937273 -2.011845 1.350581
C  -3.876561 -1.693075 0.237308
C  -2.503513 -2.234257 -0.093529
C  -3.144263 -3.27198 2.154872
C  -2.346242 -0.880781 2.155561
C  -5.08336 -2.517018 -0.036942
C  -1.493139 -1.374865 -0.732453
C  -5.563579 -2.799629 -1.25061
C  -6.796744 -3.631592 -1.428472
C  -4.929236 -2.324506 -2.520909
C  0.600463 -1.420871 -1.824352
C  1.473481 -0.721116 -0.819867
C  2.085113 0.473634 -1.174868
C  1.720943 -1.271043 0.434485
C  2.957264 1.100432 -0.295821
C  2.578932 -0.624694 1.312015
C  3.209803 0.559157 0.957876
C  3.829605 3.285703 0.066096
C  2.90814 3.730883 1.006352
C  5.026173 3.962238 -0.12692
C  3.201737 4.859506 1.758647
C  5.300258 5.095802 0.624246
C  4.393681 5.546911 1.573365
H  -3.986465 -0.629359 0.036902
H  -2.457633 -3.27549 -0.393061
H  -3.530283 -4.095453 1.553676
H  -3.846748 -3.099486 2.973287
H  -2.201763 -3.601359 2.59683
H  -1.341458 -1.126851 2.505953
H  -2.963508 -0.697566 3.037376
H  -2.288645 0.054329 1.60247
H  -5.61962 -2.895348 0.829285
H  -6.587979 -4.514442 -2.038812
H  -7.576732 -3.072964 -1.952599
H  -7.207065 -3.97045 -0.477142
H  -4.603753 -3.170454 -3.132808
H  -4.068349 -1.678176 -2.359338
H  -5.651398 -1.769976 -3.125967
H  0.248421 -0.723335 -2.587554
H  1.168844 -2.201014 -2.332777
H  1.891433 0.920523 -2.143302
H  1.255073 -2.201603 0.732823
H  2.773345 -1.054817 2.286075
H  3.891657 1.039027 1.648403
H  1.967405 3.214459 1.150613
H  5.732843 3.60579 -0.866044
H  2.483743 5.206178 2.490772
H  6.23247 5.623344 0.468159
H  4.611528 6.429199 2.160623
elementType: O C H
totalener: -1117.86914794 hartree
nucrepener: 2179.15817339 hartree
electener: -3297.02732134 hartree
oneelecener: -5848.07245769 hartree
twoeener: 2551.04513635 hartree
cpcmener: -0.02500916 hartree
kineticenergy: 1112.80756797 hartree
xcener: -110.227530615151 hartree
chargesum: 0.0000000
charge: -0.292015 -0.465460 -0.328437 0.151894 -0.017085 -0.107682 -0.286588 -0.276156 -0.292321 0.376182 -0.016573 -0.227002 -0.238797 0.102246 0.056935 -0.266088 -0.259728 0.277844 -0.122133 -0.206875 0.285040 -0.192720 -0.249100 -0.146208 -0.122214 -0.186081 0.104239 0.094558 0.093214 0.098351 0.096952 0.093914 0.097689 0.093207 0.121185 0.093359 0.095727 0.088614 0.097983 0.081102 0.100409 0.114005 0.121189 0.130338 0.142505 0.158689 0.155985 0.157720 0.144992 0.158879 0.156920 0.157394
qa: -0.2920 -0.4655 -0.3284 0.1519 -0.0171 -0.1077 -0.2866 -0.2762 -0.2923 0.3762 -0.0166 -0.2270 -0.2388 0.1022 0.0569 -0.2661 -0.2597 0.2778 -0.1221 -0.2069 0.2850 -0.1927 -0.2491 -0.1462 -0.1222 -0.1861 0.1042 0.0946 0.0932 0.0984 0.0970 0.0939 0.0977 0.0932 0.1212 0.0934 0.0957 0.0886 0.0980 0.0811 0.1004 0.1140 0.1212 0.1303 0.1425 0.1587 0.1560 0.1577 0.1450 0.1589 0.1569 0.1574
va: 2.1106 2.0378 2.0735 3.7021 3.8265 3.7961 3.9070 3.8900 3.8909 4.1684 3.7118 3.9309 3.9349 3.7891 3.6151 4.0839 3.9530 3.7366 3.8942 3.9320 3.6922 3.9076 4.0056 3.8935 3.8870 3.9038 1.0254 1.0315 1.0021 1.0000 1.0032 1.0017 1.0022 1.0176 1.0032 0.9968 0.9962 1.0065 0.9988 1.0146 0.9996 1.0125 0.9908 1.0198 1.0138 0.9903 0.9965 0.9972 1.0086 0.9905 0.9893 0.9907
dispcorr: -0.024061877 hartree
energy: -1117.893209821116
dipole: -29.72854 29.58909 -0.13945 -16.82360 15.79968 -1.02392 4.34206 -3.87635 0.46571
magnitude: 1.13346 au
magnitude: 2.88104 debye
