program: Orca
programVersion: 5.0.2
elementType: O O O C C C C C C C C C C C C C C C C C C C C C C C H H H H H H H H H H H H H H H H H H H H H H H H H H
charge: 0
multiplicity: 1
keywords: wb97x-d3
keywords: def2-TZVPP
keywords: def2/J RIJCOSX
keywords: DEFGRID2
keywords: scfconv7
keywords: smallprint printgap noloewdin
keywords: NOSOSCF
formula: C23H26O3
InChI: InChI=1/C23H26O3/c1-16(2)13-20-21(23(20,3)4)22(24)25-15-17-9-8-12-19(14-17)26-18-10-6-5-7-11-18/h5-14,20-21H,15H2,1-4H3
52 atoms
O  -0.893625 -0.969309 -1.450606
O  -1.475843 -0.097672 0.521669
O  3.686283 1.903966 1.133879
C  -2.424978 -3.087195 0.968552
C  -3.592565 -2.178259 0.787151
C  -2.470309 -2.142642 -0.227442
C  -2.576873 -4.551478 0.634655
C  -1.462721 -2.837527 2.103448
C  -4.933447 -2.685278 0.393555
C  -1.587226 -0.968002 -0.309076
C  -5.784127 -2.057401 -0.422315
C  -7.122756 -2.642247 -0.753325
C  -5.48502 -0.743208 -1.07456
C  0.070527 0.06567 -1.631776
C  1.281343 -0.120443 -0.759803
C  1.897002 0.995154 -0.207662
C  1.814468 -1.386846 -0.533504
C  3.058874 0.845832 0.54031
C  2.955487 -1.524024 0.241908
C  3.591863 -0.412629 0.774666
C  3.789543 3.107669 0.494428
C  3.714598 4.24443 1.287718
C  4.022471 3.212957 -0.872231
C  3.872049 5.495044 0.707988
C  4.16394 4.471498 -1.439597
C  4.090051 5.61635 -0.657419
H  -3.601219 -1.320434 1.456321
H  -2.663339 -2.628245 -1.177656
H  -1.608005 -4.992144 0.391216
H  -3.239042 -4.723249 -0.214269
H  -2.981125 -5.101259 1.487804
H  -1.418747 -1.794077 2.411244
H  -0.450522 -3.153251 1.838678
H  -1.768819 -3.419582 2.976422
H  -5.242052 -3.631909 0.829096
H  -7.279825 -3.610997 -0.278581
H  -7.235916 -2.774268 -1.832948
H  -7.932046 -1.977843 -0.438632
H  -5.455124 -0.848156 -2.162909
H  -4.540321 -0.306804 -0.754817
H  -6.275037 -0.018659 -0.85995
H  -0.377219 1.049951 -1.475713
H  0.350954 -0.001685 -2.684336
H  1.462686 1.975941 -0.363433
H  1.347486 -2.267992 -0.955013
H  3.366907 -2.50853 0.423791
H  4.489551 -0.520099 1.370422
H  3.538676 4.148725 2.351961
H  4.098277 2.330709 -1.495295
H  3.815596 6.378748 1.330538
H  4.341091 4.552278 -2.504534
H  4.204778 6.593476 -1.107822
elementType: O C H
totalener: -1117.86905963 hartree
nucrepener: 2190.05779282 hartree
electener: -3307.92685245 hartree
oneelecener: -5869.87631563 hartree
twoeener: 2561.94946318 hartree
cpcmener: -0.02537151 hartree
kineticenergy: 1112.79827283 hartree
xcener: -110.225885300148 hartree
chargesum: 0.0000000
charge: -0.291718 -0.466138 -0.328377 0.149038 -0.015025 -0.106446 -0.288376 -0.276540 -0.292471 0.376238 -0.015872 -0.227814 -0.240160 0.100526 0.054362 -0.219297 -0.271600 0.283803 -0.104915 -0.257413 0.295031 -0.254376 -0.199322 -0.118210 -0.142909 -0.191172 0.103466 0.095051 0.097508 0.093292 0.098859 0.094181 0.093378 0.097778 0.121567 0.089100 0.093189 0.096274 0.098561 0.081720 0.100129 0.113959 0.121164 0.142165 0.140515 0.157076 0.146154 0.145284 0.155292 0.157323 0.158646 0.157522
qa: -0.2917 -0.4661 -0.3284 0.1490 -0.0150 -0.1064 -0.2884 -0.2765 -0.2925 0.3762 -0.0159 -0.2278 -0.2402 0.1005 0.0544 -0.2193 -0.2716 0.2838 -0.1049 -0.2574 0.2950 -0.2544 -0.1993 -0.1182 -0.1429 -0.1912 0.1035 0.0951 0.0975 0.0933 0.0989 0.0942 0.0934 0.0978 0.1216 0.0891 0.0932 0.0963 0.0986 0.0817 0.1001 0.1140 0.1212 0.1422 0.1405 0.1571 0.1462 0.1453 0.1553 0.1573 0.1586 0.1575
va: 2.1114 2.0375 2.0789 3.7023 3.8245 3.7966 3.9073 3.8882 3.8887 4.1725 3.7100 3.9312 3.9353 3.7984 3.5961 3.9655 3.9557 3.7122 3.8842 4.0242 3.6910 4.0086 3.9072 3.8838 3.8908 3.9101 1.0266 1.0306 1.0033 1.0019 0.9999 1.0176 1.0017 1.0020 1.0032 1.0064 0.9967 0.9962 0.9986 1.0145 0.9999 1.0124 0.9909 1.0077 1.0138 0.9889 1.0066 1.0088 0.9978 0.9892 0.9904 0.9908
dispcorr: -0.024205356 hartree
energy: -1117.893264983257
dipole: -29.13842 28.80077 -0.33766 -17.63836 17.05013 -0.58823 -1.51223 0.27699 -1.23525
magnitude: 1.40920 au
magnitude: 3.58191 debye
