program: Orca
programVersion: 5.0.2
elementType: O O O C C C C C C C C C C C C C C C C C C C C C C C H H H H H H H H H H H H H H H H H H H H H H H H H H
charge: 0
multiplicity: 1
keywords: wb97x-d3
keywords: def2-TZVPP
keywords: def2/J RIJCOSX
keywords: DEFGRID2
keywords: scfconv7
keywords: smallprint printgap noloewdin
keywords: NOSOSCF
formula: C23H26O3
InChI: InChI=1/C23H26O3/c1-16(2)13-20-21(23(20,3)4)22(24)25-15-17-9-8-12-19(14-17)26-18-10-6-5-7-11-18/h5-14,20-21H,15H2,1-4H3
52 atoms
O  -0.735264 -0.984446 -1.64398
O  -1.395993 -0.18626 0.33419
O  3.580343 1.886608 1.330949
C  -2.374917 -3.185223 0.625683
C  -3.526916 -2.253578 0.444023
C  -2.363687 -2.198543 -0.532481
C  -2.513386 -4.636646 0.233035
C  -1.458503 -2.984007 1.807734
C  -4.866944 -2.696327 -0.005191
C  -1.473794 -1.024542 -0.532549
C  -5.907283 -1.888889 -0.233636
C  -7.241657 -2.437811 -0.637658
C  -5.84875 -0.396975 -0.109573
C  0.230006 0.060901 -1.75306
C  1.390633 -0.125244 -0.815034
C  1.923969 0.979163 -0.164931
C  1.959646 -1.381594 -0.620904
C  3.039159 0.830842 0.651516
C  3.051188 -1.520524 0.221979
C  3.606084 -0.417403 0.85546
C  3.7122 3.09814 0.709154
C  4.142954 3.208073 -0.60783
C  3.450705 4.231675 1.465168
C  4.295449 4.468163 -1.167364
C  3.617914 5.48587 0.894988
C  4.032538 5.61077 -0.423479
H  -3.53111 -1.421171 1.141334
H  -2.523684 -2.644108 -1.508025
H  -1.529003 -5.079155 0.068007
H  -3.088843 -4.778199 -0.681562
H  -3.000865 -5.207849 1.02617
H  -1.803957 -3.592658 2.646215
H  -1.419968 -1.952622 2.152362
H  -0.439134 -3.298215 1.572322
H  -5.015017 -3.763701 -0.139501
H  -7.242712 -3.526916 -0.686499
H  -7.545144 -2.055942 -1.616289
H  -8.021271 -2.132497 0.065868
H  -4.843267 -0.012534 0.051092
H  -6.475747 -0.048098 0.714762
H  -6.240912 0.077117 -1.012166
H  -0.236477 1.038257 -1.610112
H  0.571183 0.009993 -2.787947
H  1.465551 1.952548 -0.297122
H  1.555823 -2.252445 -1.121924
H  3.490035 -2.497694 0.377103
H  4.467406 -0.524027 1.502843
H  4.361806 2.325115 -1.195096
H  3.120283 4.13132 2.491408
H  4.628326 4.553203 -2.193739
H  3.412218 6.368973 1.485942
H  4.154614 6.590087 -0.86721
elementType: O C H
totalener: -1117.86953797 hartree
nucrepener: 2183.90493132 hartree
electener: -3301.77446929 hartree
oneelecener: -5857.66434774 hartree
twoeener: 2555.88987845 hartree
cpcmener: -0.02570456 hartree
kineticenergy: 1112.80459494 hartree
xcener: -110.227013561706 hartree
chargesum: -0.0000000
charge: -0.291398 -0.468049 -0.331187 0.142590 -0.054519 -0.053236 -0.297950 -0.269191 -0.255586 0.373342 -0.021489 -0.230676 -0.255828 0.099404 0.045811 -0.192262 -0.266313 0.254362 -0.109426 -0.246353 0.268147 -0.178375 -0.242291 -0.149485 -0.123722 -0.184618 0.100156 0.092256 0.098947 0.088004 0.103694 0.098248 0.093876 0.093028 0.121152 0.088003 0.093916 0.093009 0.083442 0.099538 0.093653 0.114280 0.121682 0.141814 0.140528 0.157050 0.146834 0.155031 0.146220 0.158962 0.157367 0.157609
qa: -0.2914 -0.4680 -0.3312 0.1426 -0.0545 -0.0532 -0.2980 -0.2692 -0.2556 0.3733 -0.0215 -0.2307 -0.2558 0.0994 0.0458 -0.1923 -0.2663 0.2544 -0.1094 -0.2464 0.2681 -0.1784 -0.2423 -0.1495 -0.1237 -0.1846 0.1002 0.0923 0.0989 0.0880 0.1037 0.0982 0.0939 0.0930 0.1212 0.0880 0.0939 0.0930 0.0834 0.0995 0.0937 0.1143 0.1217 0.1418 0.1405 0.1571 0.1468 0.1550 0.1462 0.1590 0.1574 0.1576
va: 2.1164 2.0336 2.0702 3.7569 3.8398 3.7907 3.9166 3.8819 3.8885 4.1892 3.7160 3.9306 3.9447 3.8011 3.5987 3.9452 3.9497 3.7324 3.8878 4.0202 3.7112 3.8966 4.0039 3.8962 3.8873 3.9025 1.0225 1.0325 1.0020 1.0022 0.9985 1.0015 1.0178 1.0022 1.0057 1.0078 0.9964 0.9952 1.0154 0.9970 0.9983 1.0112 0.9912 1.0079 1.0131 0.9888 1.0058 0.9976 1.0078 0.9904 0.9893 0.9906
dispcorr: -0.023669994 hartree
energy: -1117.893207967586
dipole: -29.86735 29.59911 -0.26824 -16.87752 16.35694 -0.52058 -0.64482 -0.51532 -1.16014
magnitude: 1.29956 au
magnitude: 3.30323 debye
