program: Orca
programVersion: 5.0.2
elementType: O O O C C C C C C C C C C C C C C C C C C C C C C C H H H H H H H H H H H H H H H H H H H H H H H H H H
charge: 0
multiplicity: 1
keywords: wb97x-d3
keywords: def2-TZVPP
keywords: def2/J RIJCOSX
keywords: DEFGRID2
keywords: scfconv7
keywords: smallprint printgap noloewdin
keywords: NOSOSCF
formula: C23H26O3
InChI: InChI=1/C23H26O3/c1-16(2)13-20-21(23(20,3)4)22(24)25-15-17-9-8-12-19(14-17)26-18-10-6-5-7-11-18/h5-14,20-21H,15H2,1-4H3
52 atoms
O  0.744579 -2.618794 -1.03562
O  0.214567 -2.247069 1.103895
O  2.678106 1.994856 -0.482935
C  -2.72729 -2.055703 0.021875
C  -2.138397 -0.680987 0.032379
C  -1.380354 -1.80877 -0.634983
C  -3.860067 -2.351572 -0.93007
C  -2.831755 -2.814317 1.321345
C  -2.648439 0.433932 -0.806625
C  -0.095143 -2.244326 -0.063049
C  -3.641782 1.253947 -0.456078
C  -4.068301 2.385033 -1.340317
C  -4.39283 1.128909 0.832768
C  2.092277 -2.896766 -0.686576
C  2.887168 -1.655581 -0.372626
C  2.384511 -0.380945 -0.589436
C  4.180575 -1.803566 0.12519
C  3.157002 0.729333 -0.269687
C  4.9528 -0.688926 0.405291
C  4.442427 0.590211 0.224015
C  1.460884 2.345668 0.033061
C  0.717519 3.273622 -0.685245
C  0.991729 1.85147 1.245027
C  -0.493659 3.720941 -0.178367
C  -0.225815 2.303499 1.73537
C  -0.972601 3.238719 1.032411
H  -1.727971 -0.385517 0.995408
H  -1.401861 -1.805358 -1.719475
H  -3.74525 -1.84746 -1.889072
H  -4.812937 -2.033634 -0.501678
H  -3.928135 -3.423637 -1.124626
H  -2.704276 -3.887504 1.165585
H  -3.825392 -2.665219 1.749086
H  -2.106679 -2.493574 2.065317
H  -2.153967 0.597902 -1.760145
H  -3.464001 2.450509 -2.245054
H  -3.996176 3.342096 -0.81644
H  -5.114499 2.277832 -1.639666
H  -4.066056 0.287123 1.441684
H  -5.463668 1.009766 0.646635
H  -4.285002 2.036906 1.432732
H  2.510762 -3.396713 -1.560869
H  2.145232 -3.602145 0.14615
H  1.397386 -0.226206 -1.007925
H  4.583785 -2.795322 0.292935
H  5.957681 -0.812678 0.788096
H  5.033682 1.465022 0.462981
H  1.091792 3.647276 -1.630291
H  1.56655 1.131078 1.813347
H  -1.067341 4.447121 -0.739868
H  -0.586959 1.920833 2.681402
H  -1.917981 3.588635 1.4257
elementType: O C H
totalener: -1117.86848107 hartree
nucrepener: 2363.42228527 hartree
electener: -3481.29076634 hartree
oneelecener: -6216.86046706 hartree
twoeener: 2735.56970072 hartree
cpcmener: -0.02588276 hartree
kineticenergy: 1112.80607713 hartree
xcener: -110.230306533628 hartree
chargesum: 0.0000000
charge: -0.295033 -0.458360 -0.332561 0.132089 -0.062736 -0.037569 -0.277033 -0.299212 -0.224126 0.343967 -0.055176 -0.240634 -0.248089 0.085392 0.026582 -0.186794 -0.230769 0.234784 -0.122761 -0.228637 0.280352 -0.232908 -0.173543 -0.135617 -0.170047 -0.172374 0.102550 0.092664 0.091790 0.096834 0.101799 0.103038 0.093943 0.093878 0.118421 0.092703 0.090183 0.106632 0.090520 0.104254 0.097852 0.129306 0.117125 0.149334 0.142631 0.157201 0.146278 0.143654 0.150739 0.154781 0.158131 0.154574
qa: -0.2950 -0.4584 -0.3326 0.1321 -0.0627 -0.0376 -0.2770 -0.2992 -0.2241 0.3440 -0.0552 -0.2406 -0.2481 0.0854 0.0266 -0.1868 -0.2308 0.2348 -0.1228 -0.2286 0.2804 -0.2329 -0.1735 -0.1356 -0.1700 -0.1724 0.1026 0.0927 0.0918 0.0968 0.1018 0.1030 0.0939 0.0939 0.1184 0.0927 0.0902 0.1066 0.0905 0.1043 0.0979 0.1293 0.1171 0.1493 0.1426 0.1572 0.1463 0.1437 0.1507 0.1548 0.1581 0.1546
va: 2.1132 2.0379 2.0723 3.7638 3.7933 3.8104 3.9065 3.8926 3.7845 4.1971 3.6961 3.9223 3.9269 3.8113 3.6375 3.9331 3.9763 3.7654 3.8847 4.0062 3.6889 4.0004 3.8391 3.8693 3.8593 3.8378 1.0245 1.0345 1.0028 1.0000 1.0033 0.9996 1.0008 1.0202 1.0087 1.0063 0.9956 0.9986 1.0071 0.9989 1.0016 0.9909 1.0108 1.0061 0.9999 0.9889 1.0050 1.0084 1.0021 0.9908 0.9926 0.9888
dispcorr: -0.029677299 hartree
energy: -1117.898158374029
dipole: -29.99639 29.21088 -0.78551 -1.10188 0.79353 -0.30836 0.86968 -1.38144 -0.51176
magnitude: 0.98692 au
magnitude: 2.50855 debye
