program: Orca
programVersion: 5.0.2
elementType: O O O C C C C C C C C C C C C C C C C C C C C C C C H H H H H H H H H H H H H H H H H H H H H H H H H H
charge: 0
multiplicity: 1
keywords: wb97x-d3
keywords: def2-TZVPP
keywords: def2/J RIJCOSX
keywords: DEFGRID2
keywords: scfconv7
keywords: smallprint printgap noloewdin
keywords: NOSOSCF
formula: C23H26O3
InChI: InChI=1/C23H26O3/c1-16(2)13-20-21(23(20,3)4)22(24)25-15-17-9-8-12-19(14-17)26-18-10-6-5-7-11-18/h5-14,20-21H,15H2,1-4H3
52 atoms
O  0.38812 -1.84996 1.36133
O  -0.309508 -2.480784 -0.668687
O  3.230897 1.642382 -0.974861
C  -2.094686 0.10647 -0.196512
C  -2.941208 -1.13172 -0.125199
C  -1.672333 -1.052001 0.693517
C  -2.534707 1.358536 0.522287
C  -1.358305 0.391741 -1.481325
C  -4.245904 -1.153202 0.566533
C  -0.495961 -1.874257 0.357557
C  -5.388709 -1.592955 0.032452
C  -6.667398 -1.571678 0.812653
C  -5.478595 -2.140264 -1.368033
C  1.630437 -2.515717 1.197236
C  2.677661 -1.655343 0.539569
C  2.411709 -0.366721 0.09675
C  3.959819 -2.181687 0.403203
C  3.43206 0.390321 -0.470715
C  4.965206 -1.418624 -0.166546
C  4.712838 -0.125685 -0.60081
C  2.243211 2.460019 -0.498874
C  2.010581 2.635261 0.860373
C  1.515665 3.176793 -1.438721
C  1.032339 3.529975 1.26971
C  0.551369 4.080065 -1.014375
C  0.300276 4.2561 0.339206
H  -2.86869 -1.765167 -1.00406
H  -1.796359 -0.86871 1.755467
H  -1.679132 2.013474 0.700463
H  -2.996292 1.155105 1.487819
H  -3.256022 1.915344 -0.079971
H  -0.437319 0.949224 -1.294176
H  -1.984007 1.008309 -2.130397
H  -1.101945 -0.506739 -2.039019
H  -4.264046 -0.774437 1.584138
H  -7.085159 -2.577474 0.912638
H  -7.427786 -0.973483 0.303039
H  -6.534247 -1.162631 1.814525
H  -4.923412 -3.074863 -1.476914
H  -5.081037 -1.445384 -2.109769
H  -6.511909 -2.350404 -1.644382
H  1.50689 -3.45386 0.651259
H  1.953249 -2.770823 2.207654
H  1.421579 0.05861 0.192377
H  4.170968 -3.187275 0.747443
H  5.961981 -1.82816 -0.267265
H  5.498574 0.475872 -1.040013
H  2.58417 2.086469 1.596849
H  1.711034 3.03246 -2.494072
H  0.848258 3.663775 2.32807
H  -0.009825 4.642146 -1.749735
H  -0.457638 4.955001 0.667796
elementType: O C H
totalener: -1117.86857022 hartree
nucrepener: 2295.80318480 hartree
electener: -3413.67175502 hartree
oneelecener: -6081.04092589 hartree
twoeener: 2667.36917087 hartree
cpcmener: -0.02533931 hartree
kineticenergy: 1112.78917969 hartree
xcener: -110.228582272497 hartree
chargesum: -0.0000000
charge: -0.289394 -0.456677 -0.325436 0.140288 0.040890 -0.102611 -0.270332 -0.263716 -0.305396 0.363546 -0.010949 -0.221495 -0.284616 0.079550 0.027608 -0.225410 -0.263378 0.342274 -0.098404 -0.271895 0.301957 -0.208122 -0.246634 -0.126057 -0.114878 -0.198532 0.093226 0.088238 0.079750 0.092025 0.099265 0.057038 0.102723 0.100962 0.115482 0.097836 0.095576 0.084020 0.104200 0.103479 0.094230 0.116908 0.129260 0.121800 0.141111 0.156208 0.143662 0.155354 0.143592 0.158782 0.156428 0.156668
qa: -0.2894 -0.4567 -0.3254 0.1403 0.0409 -0.1026 -0.2703 -0.2637 -0.3054 0.3635 -0.0109 -0.2215 -0.2846 0.0796 0.0276 -0.2254 -0.2634 0.3423 -0.0984 -0.2719 0.3020 -0.2081 -0.2466 -0.1261 -0.1149 -0.1985 0.0932 0.0882 0.0797 0.0920 0.0993 0.0570 0.1027 0.1010 0.1155 0.0978 0.0956 0.0840 0.1042 0.1035 0.0942 0.1169 0.1293 0.1218 0.1411 0.1562 0.1437 0.1554 0.1436 0.1588 0.1564 0.1567
va: 2.1173 2.0444 2.0921 3.6409 3.7913 3.8578 3.9129 3.8870 3.8963 4.2120 3.6927 3.9205 3.9404 3.8256 3.6859 3.9213 3.9937 3.6642 3.8799 4.0047 3.6478 3.9045 3.9588 3.8296 3.8385 3.8691 1.0290 1.0379 1.0105 1.0085 1.0024 1.0146 1.0028 1.0230 1.0106 0.9926 0.9933 1.0104 0.9965 0.9957 1.0048 1.0135 0.9906 1.0094 1.0008 0.9889 1.0092 0.9960 1.0100 0.9900 0.9893 0.9923
dispcorr: -0.027032220 hartree
energy: -1117.895602435962
dipole: -30.87203 30.29057 -0.58145 -0.74033 1.19527 0.45494 -0.29566 1.34417 1.04851
magnitude: 1.28235 au
magnitude: 3.25948 debye
