program: Orca
programVersion: 5.0.2
elementType: O O O C C C C C C C C C C C C C C C C C C C C C C C H H H H H H H H H H H H H H H H H H H H H H H H H H
charge: 0
multiplicity: 1
keywords: wb97x-d3
keywords: def2-TZVPP
keywords: def2/J RIJCOSX
keywords: DEFGRID2
keywords: scfconv7
keywords: smallprint printgap noloewdin
keywords: NOSOSCF
formula: C23H26O3
InChI: InChI=1/C23H26O3/c1-16(2)13-20-21(23(20,3)4)22(24)25-15-17-9-8-12-19(14-17)26-18-10-6-5-7-11-18/h5-14,20-21H,15H2,1-4H3
52 atoms
O  0.249627 -2.851481 -0.620588
O  -0.536615 -1.707778 1.128046
O  3.72553 1.793833 0.7128
C  -3.094196 -3.463639 0.664726
C  -3.299594 -2.135234 0.004206
C  -2.037692 -2.930784 -0.287017
C  -3.870908 -4.665005 0.180276
C  -2.845052 -3.493473 2.153036
C  -4.268444 -1.923999 -1.089394
C  -0.73421 -2.420041 0.172677
C  -5.128727 -0.907215 -1.206643
C  -6.041671 -0.810683 -2.391765
C  -5.26964 0.21251 -0.220594
C  1.571582 -2.402084 -0.331209
C  1.777178 -0.944912 -0.641008
C  2.599048 -0.189624 0.184285
C  1.195245 -0.352035 -1.757962
C  2.858168 1.141413 -0.11479
C  1.449196 0.982035 -2.037504
C  2.283357 1.740177 -1.228277
C  3.59495 3.143086 0.912435
C  4.725711 3.930618 0.759107
C  2.387697 3.700976 1.31556
C  4.647831 5.292559 1.018327
C  2.321317 5.064427 1.560753
C  3.447331 5.864828 1.413765
H  -3.140256 -1.287721 0.661958
H  -2.006772 -3.426032 -1.251348
H  -3.974368 -4.699306 -0.903545
H  -4.875092 -4.669011 0.609494
H  -3.376351 -5.587737 0.490304
H  -2.400202 -2.577649 2.534563
H  -2.191578 -4.324986 2.425868
H  -3.792299 -3.637695 2.676814
H  -4.263553 -2.669843 -1.87915
H  -5.903237 0.138099 -2.917757
H  -7.090487 -0.84089 -2.083967
H  -5.8783 -1.616562 -3.107482
H  -4.712151 0.060265 0.701373
H  -6.3188 0.353833 0.04963
H  -4.936031 1.157027 -0.658856
H  2.212043 -3.013964 -0.967816
H  1.836785 -2.620042 0.705557
H  3.044758 -0.633614 1.067136
H  0.547431 -0.920875 -2.412758
H  0.999512 1.442775 -2.907587
H  2.480954 2.775808 -1.473786
H  5.6595 3.480275 0.446322
H  1.509168 3.080385 1.443083
H  5.531371 5.907027 0.902811
H  1.382356 5.501083 1.875927
H  3.389009 6.927242 1.610627
elementType: O C H
totalener: -1117.87067392 hartree
nucrepener: 2168.21688258 hartree
electener: -3286.08755650 hartree
oneelecener: -5826.35685292 hartree
twoeener: 2540.26929642 hartree
cpcmener: -0.02604857 hartree
kineticenergy: 1112.80472466 hartree
xcener: -110.227511836361 hartree
chargesum: -0.0000000
charge: -0.294136 -0.467187 -0.329607 0.103124 0.046528 -0.090760 -0.268058 -0.277790 -0.281341 0.385761 -0.041791 -0.218786 -0.255341 0.108930 0.041198 -0.254497 -0.244236 0.263915 -0.137319 -0.194638 0.249705 -0.225705 -0.173831 -0.133861 -0.150431 -0.172074 0.092812 0.085670 0.087170 0.097191 0.097284 0.093592 0.097788 0.093979 0.115400 0.091975 0.093426 0.087431 0.090996 0.092744 0.099425 0.119807 0.113593 0.128726 0.140566 0.157513 0.154138 0.146353 0.159857 0.157595 0.159167 0.158027
qa: -0.2941 -0.4672 -0.3296 0.1031 0.0465 -0.0908 -0.2681 -0.2778 -0.2813 0.3858 -0.0418 -0.2188 -0.2553 0.1089 0.0412 -0.2545 -0.2442 0.2639 -0.1373 -0.1946 0.2497 -0.2257 -0.1738 -0.1339 -0.1504 -0.1721 0.0928 0.0857 0.0872 0.0972 0.0973 0.0936 0.0978 0.0940 0.1154 0.0920 0.0934 0.0874 0.0910 0.0927 0.0994 0.1198 0.1136 0.1287 0.1406 0.1575 0.1541 0.1464 0.1599 0.1576 0.1592 0.1580
va: 2.1156 2.0391 2.0679 3.6979 3.7668 3.8363 3.9106 3.9018 3.8869 4.1645 3.7543 3.9227 3.9420 3.7875 3.6431 4.0638 3.9607 3.7522 3.9145 3.9013 3.7143 4.0010 3.9171 3.8885 3.8940 3.8933 1.0311 1.0385 1.0064 1.0017 1.0019 1.0205 0.9993 1.0003 1.0116 0.9957 0.9964 1.0091 1.0091 0.9980 0.9957 0.9909 1.0111 1.0201 1.0136 0.9910 0.9979 1.0067 0.9952 0.9895 0.9903 0.9903
dispcorr: -0.022668562 hartree
energy: -1117.893342477447
dipole: -33.81038 33.12761 -0.68277 -10.82540 10.74046 -0.08494 -2.58384 1.71261 -0.87123
magnitude: 1.11015 au
magnitude: 2.82177 debye
