program: Orca
programVersion: 5.0.2
elementType: O O O C C C C C C C C C C C C C C C C C C C C C C C H H H H H H H H H H H H H H H H H H H H H H H H H H
charge: 0
multiplicity: 1
keywords: wb97x-d3
keywords: def2-TZVPP
keywords: def2/J RIJCOSX
keywords: DEFGRID2
keywords: scfconv7
keywords: smallprint printgap noloewdin
keywords: NOSOSCF
formula: C23H26O3
InChI: InChI=1/C23H26O3/c1-16(2)13-20-21(23(20,3)4)22(24)25-15-17-9-8-12-19(14-17)26-18-10-6-5-7-11-18/h5-14,20-21H,15H2,1-4H3
52 atoms
O  -0.049893 -1.667083 -1.334265
O  0.198368 -3.679016 -0.394395
O  3.528111 1.971268 0.537806
C  -2.098089 -1.387027 1.015793
C  -2.757395 -1.386879 -0.333944
C  -1.796927 -2.493978 0.016729
C  -2.903836 -1.793923 2.225031
C  -1.067006 -0.32537 1.314086
C  -4.194769 -1.716427 -0.50991
C  -0.460109 -2.681756 -0.582312
C  -5.176692 -0.820097 -0.639373
C  -6.598181 -1.2477 -0.841828
C  -4.956577 0.660609 -0.598752
C  1.289037 -1.692642 -1.853047
C  2.269832 -1.200389 -0.827254
C  2.415827 0.170811 -0.633702
C  3.013888 -2.088724 -0.058086
C  3.289446 0.642446 0.336779
C  3.891185 -1.605276 0.902238
C  4.026457 -0.242663 1.112775
C  2.542551 2.904084 0.3701
C  2.909975 4.105746 -0.218596
C  1.244183 2.706187 0.824457
C  1.968983 5.116279 -0.354652
C  0.309816 3.719821 0.66737
C  0.664337 4.926716 0.079082
H  -2.371002 -0.63361 -1.013959
H  -2.250203 -3.446646 0.272144
H  -3.594896 -2.610136 2.014578
H  -3.492627 -0.950515 2.594154
H  -2.246664 -2.117483 3.034945
H  -0.263935 -0.715189 1.944028
H  -1.536087 0.497983 1.857277
H  -0.617304 0.096003 0.417578
H  -4.455753 -2.77082 -0.536858
H  -7.24224 -0.863648 -0.046198
H  -6.702736 -2.332614 -0.86458
H  -6.999024 -0.852301 -1.779171
H  -5.590449 1.121136 0.163044
H  -5.2351 1.123024 -1.54929
H  -3.926366 0.938039 -0.381532
H  1.261932 -1.025012 -2.712976
H  1.547402 -2.690276 -2.208092
H  1.853628 0.860483 -1.252664
H  2.916485 -3.155163 -0.211137
H  4.471397 -2.295612 1.500588
H  4.707705 0.136062 1.864414
H  3.927119 4.249709 -0.56101
H  0.958004 1.778046 1.302778
H  2.260189 6.053843 -0.810254
H  -0.702566 3.562249 1.016851
H  -0.068731 5.714243 -0.03553
elementType: O C H
totalener: -1117.86700994 hartree
nucrepener: 2268.52804865 hartree
electener: -3386.39505859 hartree
oneelecener: -6026.04985396 hartree
twoeener: 2639.65479537 hartree
cpcmener: -0.02499322 hartree
kineticenergy: 1112.80805933 hartree
xcener: -110.226762451395 hartree
chargesum: 0.0000000
charge: -0.270923 -0.468917 -0.328718 0.166000 0.027956 -0.143586 -0.271991 -0.332586 -0.284367 0.408033 -0.030594 -0.229473 -0.252387 0.054503 0.001651 -0.252164 -0.180161 0.308294 -0.128894 -0.245739 0.298015 -0.241584 -0.230626 -0.124460 -0.159978 -0.178218 0.103118 0.092340 0.091426 0.095187 0.100121 0.112113 0.102105 0.084050 0.119239 0.093924 0.088813 0.093649 0.095116 0.101013 0.086327 0.119419 0.116873 0.144368 0.141258 0.156394 0.145643 0.145002 0.192419 0.157625 0.155938 0.157430
qa: -0.2709 -0.4689 -0.3287 0.1660 0.0280 -0.1436 -0.2720 -0.3326 -0.2844 0.4080 -0.0306 -0.2295 -0.2524 0.0545 0.0017 -0.2522 -0.1802 0.3083 -0.1289 -0.2457 0.2980 -0.2416 -0.2306 -0.1245 -0.1600 -0.1782 0.1031 0.0923 0.0914 0.0952 0.1001 0.1121 0.1021 0.0841 0.1192 0.0939 0.0888 0.0936 0.0951 0.1010 0.0863 0.1194 0.1169 0.1444 0.1413 0.1564 0.1456 0.1450 0.1924 0.1576 0.1559 0.1574
va: 2.1195 2.0341 2.0873 3.6729 3.7485 3.8974 3.9031 3.9012 3.8563 4.2061 3.7064 3.9294 3.9423 3.8286 3.6248 3.9366 3.9362 3.6891 3.9280 4.0104 3.7093 4.0048 3.9075 3.8855 3.9081 3.9065 1.0163 1.0347 1.0033 1.0021 1.0022 0.9950 1.0001 1.0070 1.0086 0.9964 1.0079 0.9953 0.9981 0.9978 1.0080 0.9998 1.0104 1.0069 1.0181 0.9900 1.0071 1.0086 0.9684 0.9891 0.9946 0.9907
dispcorr: -0.026423680 hartree
energy: -1117.893433624469
dipole: -31.20681 30.19804 -1.00877 -0.14588 1.45156 1.30568 3.61566 -3.79407 -0.17841
magnitude: 1.65959 au
magnitude: 4.21835 debye
