program: Orca
programVersion: 5.0.2
elementType: O O O C C C C C C C C C C C C C C C C C C C C C C C H H H H H H H H H H H H H H H H H H H H H H H H H H
charge: 0
multiplicity: 1
keywords: wb97x-d3
keywords: def2-TZVPP
keywords: def2/J RIJCOSX
keywords: DEFGRID2
keywords: scfconv7
keywords: smallprint printgap noloewdin
keywords: NOSOSCF
formula: C23H26O3
InChI: InChI=1/C23H26O3/c1-16(2)13-20-21(23(20,3)4)22(24)25-15-17-9-8-12-19(14-17)26-18-10-6-5-7-11-18/h5-14,20-21H,15H2,1-4H3
52 atoms
O  -0.040009 -1.640861 -1.368508
O  0.157564 -3.688364 -0.493634
O  3.514471 1.912451 0.693337
C  -2.117365 -1.415049 0.957771
C  -2.747667 -1.33386 -0.403705
C  -1.827683 -2.483554 -0.085037
C  -2.962781 -1.848391 2.129502
C  -1.057913 -0.403825 1.326175
C  -4.189475 -1.614328 -0.621871
C  -0.479911 -2.673522 -0.65816
C  -5.143683 -0.686395 -0.733559
C  -6.570938 -1.065875 -0.986313
C  -4.885693 0.784758 -0.623882
C  1.310893 -1.665193 -1.855242
C  2.268226 -1.211101 -0.790503
C  2.421817 0.153199 -0.558196
C  2.979285 -2.126795 -0.022478
C  3.270883 0.592308 0.448571
C  3.83338 -1.675785 0.974092
C  3.976607 -0.320563 1.222317
C  2.554267 2.86308 0.480555
C  1.23518 2.688898 0.882032
C  2.966165 4.055413 -0.097515
C  0.325301 3.716716 0.681446
C  2.048716 5.080976 -0.276946
C  0.724213 4.914578 0.102758
H  -2.325588 -0.563353 -1.041464
H  -2.309837 -3.435562 0.11372
H  -2.336174 -2.233396 2.936801
H  -3.677445 -2.627806 1.865937
H  -3.529172 -1.002145 2.525541
H  -0.587216 0.055033 0.459236
H  -0.272456 -0.85248 1.938916
H  -1.507707 0.400935 1.911845
H  -4.477582 -2.659068 -0.699986
H  -6.705713 -2.146144 -1.044401
H  -6.933003 -0.631942 -1.922493
H  -7.226042 -0.685913 -0.197848
H  -5.519694 1.227926 0.148427
H  -5.137328 1.296257 -1.55691
H  -3.852208 1.025171 -0.379155
H  1.311275 -0.972912 -2.696021
H  1.569499 -2.654665 -2.232955
H  1.883669 0.863133 -1.175611
H  2.874192 -3.188064 -0.203895
H  4.388912 -2.386877 1.571702
H  4.639594 0.032072 2.002519
H  0.915612 1.766936 1.351555
H  3.999197 4.180224 -0.397663
H  -0.703346 3.577867 0.988901
H  2.374091 6.01134 -0.724359
H  0.009406 5.713163 -0.045794
elementType: O C H
totalener: -1117.86688893 hartree
nucrepener: 2270.54354825 hartree
electener: -3388.41043718 hartree
oneelecener: -6030.07612346 hartree
twoeener: 2641.66568628 hartree
cpcmener: -0.02499880 hartree
kineticenergy: 1112.80645626 hartree
xcener: -110.226466451584 hartree
chargesum: 0.0000000
charge: -0.270308 -0.468451 -0.328156 0.164377 0.026594 -0.139608 -0.272123 -0.328738 -0.285273 0.405433 -0.031135 -0.229673 -0.251571 0.053396 -0.000907 -0.253655 -0.181664 0.311883 -0.127544 -0.247523 0.288745 -0.224162 -0.236499 -0.162530 -0.126986 -0.174911 0.103987 0.092551 0.100149 0.091081 0.095092 0.082511 0.111787 0.102191 0.119147 0.088874 0.094012 0.093594 0.095356 0.100488 0.086023 0.119103 0.117195 0.144225 0.141351 0.156606 0.145719 0.194483 0.145167 0.155304 0.157368 0.157623
qa: -0.2703 -0.4685 -0.3282 0.1644 0.0266 -0.1396 -0.2721 -0.3287 -0.2853 0.4054 -0.0311 -0.2297 -0.2516 0.0534 -0.0009 -0.2537 -0.1817 0.3119 -0.1275 -0.2475 0.2887 -0.2242 -0.2365 -0.1625 -0.1270 -0.1749 0.1040 0.0926 0.1001 0.0911 0.0951 0.0825 0.1118 0.1022 0.1191 0.0889 0.0940 0.0936 0.0954 0.1005 0.0860 0.1191 0.1172 0.1442 0.1414 0.1566 0.1457 0.1945 0.1452 0.1553 0.1574 0.1576
va: 2.1187 2.0346 2.0884 3.6711 3.7468 3.8970 3.9037 3.9008 3.8559 4.2080 3.7063 3.9292 3.9426 3.8296 3.6279 3.9316 3.9367 3.6870 3.9286 4.0091 3.7178 3.9083 4.0020 3.9115 3.8861 3.9045 1.0161 1.0345 1.0020 1.0031 1.0021 1.0069 0.9951 1.0004 1.0086 1.0078 0.9952 0.9965 0.9981 0.9979 1.0081 1.0000 1.0102 1.0070 1.0181 0.9898 1.0072 0.9659 1.0083 0.9949 0.9893 0.9906
dispcorr: -0.026470818 hartree
energy: -1117.893359746436
dipole: -31.02360 30.04828 -0.97532 0.23360 1.11757 1.35117 3.07183 -3.23814 -0.16631
magnitude: 1.67469 au
magnitude: 4.25672 debye
