program: Orca
programVersion: 5.0.2
elementType: O O O C C C C C C C C C C C C C C C C C C C C C C C H H H H H H H H H H H H H H H H H H H H H H H H H H
charge: 0
multiplicity: 1
keywords: wb97x-d3
keywords: def2-TZVPP
keywords: def2/J RIJCOSX
keywords: DEFGRID2
keywords: scfconv7
keywords: smallprint printgap noloewdin
keywords: NOSOSCF
formula: C23H26O3
InChI: InChI=1/C23H26O3/c1-16(2)13-20-21(23(20,3)4)22(24)25-15-17-9-8-12-19(14-17)26-18-10-6-5-7-11-18/h5-14,20-21H,15H2,1-4H3
52 atoms
O  -0.129073 -1.541678 -1.264972
O  0.164251 -3.562256 -0.356366
O  3.55473 1.931145 0.652655
C  -2.081988 -1.299146 1.175246
C  -2.792596 -1.27554 -0.149145
C  -1.81447 -2.389112 0.151994
C  -2.823729 -1.725077 2.418996
C  -1.041843 -0.237343 1.445248
C  -4.224726 -1.613746 -0.280895
C  -0.503109 -2.564395 -0.503845
C  -5.16234 -0.895014 -0.906766
C  -6.5802 -1.379224 -0.971438
C  -4.922085 0.417966 -1.587649
C  1.181742 -1.571274 -1.851902
C  2.230039 -1.144203 -0.864555
C  2.372117 0.210357 -0.570928
C  3.047453 -2.077061 -0.237438
C  3.321245 0.620525 0.355306
C  3.998391 -1.654045 0.6814
C  4.135163 -0.31117 0.989187
C  2.556635 2.859423 0.512397
C  2.823214 3.986106 -0.250226
C  1.339111 2.711715 1.164937
C  1.858895 4.979496 -0.357409
C  0.380034 3.705707 1.039454
C  0.634428 4.841066 0.280155
H  -2.427094 -0.514858 -0.829488
H  -2.255077 -3.347723 0.405856
H  -2.119904 -2.037209 3.193438
H  -3.505347 -2.556703 2.245406
H  -3.408229 -0.894476 2.820771
H  -0.208865 -0.637055 2.028007
H  -1.488868 0.571367 2.027326
H  -0.637119 0.206534 0.53823
H  -4.532745 -2.549378 0.177694
H  -6.710612 -2.342564 -0.478107
H  -6.913255 -1.484757 -2.007655
H  -7.262153 -0.665425 -0.500942
H  -5.587228 1.185558 -1.181451
H  -5.151652 0.348383 -2.655369
H  -3.901348 0.785811 -1.491409
H  1.12354 -0.868565 -2.681978
H  1.398299 -2.558409 -2.261143
H  1.749948 0.935616 -1.082697
H  2.949447 -3.129259 -0.469209
H  4.636734 -2.378658 1.170287
H  4.875164 0.019546 1.707356
H  3.779139 4.087073 -0.748811
H  1.14308 1.835028 1.770469
H  2.067994 5.862003 -0.948411
H  -0.569773 3.593699 1.546271
H  -0.116359 5.615349 0.191488
elementType: O C H
totalener: -1117.86826680 hartree
nucrepener: 2267.15463347 hartree
electener: -3385.02290027 hartree
oneelecener: -6023.42889331 hartree
twoeener: 2638.40599304 hartree
cpcmener: -0.02580477 hartree
kineticenergy: 1112.79889937 hartree
xcener: -110.225279982786 hartree
chargesum: 0.0000000
charge: -0.273447 -0.468129 -0.330434 0.123726 0.075185 -0.123949 -0.271591 -0.308458 -0.296001 0.407559 -0.045958 -0.221881 -0.252976 0.053868 0.002743 -0.248768 -0.183064 0.297444 -0.132299 -0.240015 0.273237 -0.221046 -0.212387 -0.135557 -0.150937 -0.169200 0.095402 0.089594 0.098354 0.087728 0.096122 0.108910 0.102840 0.084060 0.116014 0.088216 0.092301 0.093206 0.094277 0.096593 0.089030 0.120708 0.116918 0.142810 0.140560 0.156417 0.145540 0.146063 0.176572 0.157942 0.157819 0.158340
qa: -0.2734 -0.4681 -0.3304 0.1237 0.0752 -0.1239 -0.2716 -0.3085 -0.2960 0.4076 -0.0460 -0.2219 -0.2530 0.0539 0.0027 -0.2488 -0.1831 0.2974 -0.1323 -0.2400 0.2732 -0.2210 -0.2124 -0.1356 -0.1509 -0.1692 0.0954 0.0896 0.0984 0.0877 0.0961 0.1089 0.1028 0.0841 0.1160 0.0882 0.0923 0.0932 0.0943 0.0966 0.0890 0.1207 0.1169 0.1428 0.1406 0.1564 0.1455 0.1461 0.1766 0.1579 0.1578 0.1583
va: 2.1196 2.0346 2.0801 3.7113 3.7202 3.8481 3.9080 3.9122 3.8642 4.1982 3.7620 3.9238 3.9428 3.8316 3.6353 3.9129 3.9412 3.7022 3.9334 4.0029 3.7033 4.0015 3.9252 3.8871 3.8997 3.9004 1.0242 1.0354 1.0013 1.0066 1.0021 0.9960 0.9989 1.0075 1.0117 1.0089 0.9961 0.9963 0.9976 0.9964 1.0104 0.9988 1.0092 1.0095 1.0168 0.9899 1.0070 1.0066 0.9810 0.9894 0.9930 0.9902
dispcorr: -0.025916974 hartree
energy: -1117.894183773088
dipole: -30.92238 29.92115 -1.00122 -0.81926 2.14182 1.32256 1.81504 -2.08696 -0.27192
magnitude: 1.68094 au
magnitude: 4.27261 debye
