program: Orca
programVersion: 5.0.2
elementType: O O O C C C C C C C C C C C C C C C C C C C C C C C H H H H H H H H H H H H H H H H H H H H H H H H H H
charge: 0
multiplicity: 1
keywords: wb97x-d3
keywords: def2-TZVPP
keywords: def2/J RIJCOSX
keywords: DEFGRID2
keywords: scfconv7
keywords: smallprint printgap noloewdin
keywords: NOSOSCF
formula: C23H26O3
InChI: InChI=1/C23H26O3/c1-16(2)13-20-21(23(20,3)4)22(24)25-15-17-9-8-12-19(14-17)26-18-10-6-5-7-11-18/h5-14,20-21H,15H2,1-4H3
52 atoms
O  0.188026 -2.830695 -0.459931
O  -0.722254 -1.54576 1.123887
O  3.831432 1.731061 0.794546
C  -3.224483 -3.37741 0.544152
C  -3.405011 -2.044333 -0.116664
C  -2.123152 -2.822938 -0.34365
C  -3.958197 -4.581946 0.005169
C  -3.056323 -3.417334 2.043079
C  -4.323727 -1.83418 -1.253813
C  -0.851311 -2.317513 0.203948
C  -5.249675 -0.875485 -1.363798
C  -6.107873 -0.779062 -2.589773
C  -5.531495 0.168095 -0.326118
C  1.49165 -2.404226 -0.074286
C  1.783015 -0.980847 -0.463235
C  2.61727 -0.220835 0.345578
C  1.271712 -0.426859 -1.633117
C  2.954518 1.075019 -0.020282
C  1.602803 0.874528 -1.979139
C  2.447122 1.636551 -1.184846
C  3.734425 3.088251 0.951789
C  2.532215 3.695436 1.294433
C  4.894842 3.83565 0.819049
C  2.502091 5.066758 1.500863
C  4.852142 5.206015 1.037723
C  3.657677 5.827159 1.373528
H  -3.292817 -1.203502 0.559258
H  -2.029638 -3.315988 -1.305265
H  -4.01269 -4.596885 -1.082743
H  -4.980558 -4.610227 0.388107
H  -3.462536 -5.502341 0.320437
H  -2.63193 -2.504159 2.454216
H  -2.419595 -4.251514 2.345924
H  -4.030624 -3.562995 2.514297
H  -4.225914 -2.533653 -2.079305
H  -7.167155 -0.879746 -2.337621
H  -5.86377 -1.544707 -3.326352
H  -5.998372 0.196767 -3.070997
H  -4.927731 0.071319 0.574244
H  -6.581294 0.130394 -0.022968
H  -5.366663 1.170126 -0.731728
H  2.166345 -3.080971 -0.600549
H  1.648288 -2.55387 0.996138
H  3.012261 -0.634152 1.26666
H  0.616231 -0.999184 -2.277078
H  1.203628 1.305412 -2.888296
H  2.705268 2.645761 -1.479632
H  1.629269 3.107654 1.406197
H  5.823956 3.347155 0.553003
H  1.56723 5.541426 1.770122
H  5.759171 5.788423 0.939403
H  3.627417 6.895671 1.541504
elementType: O C H
totalener: -1117.87080722 hartree
nucrepener: 2162.20082129 hartree
electener: -3280.07162852 hartree
oneelecener: -5814.29865938 hartree
twoeener: 2534.22703087 hartree
cpcmener: -0.02620664 hartree
kineticenergy: 1112.80001339 hartree
xcener: -110.226590586480 hartree
chargesum: -0.0000000
charge: -0.293397 -0.465611 -0.329937 0.103957 0.044491 -0.094827 -0.266407 -0.276990 -0.277227 0.385515 -0.046627 -0.218384 -0.251689 0.105772 0.040199 -0.255492 -0.239107 0.259125 -0.138522 -0.190390 0.249083 -0.171407 -0.227893 -0.151872 -0.132547 -0.173428 0.092011 0.086624 0.086992 0.097026 0.097654 0.092420 0.098101 0.095020 0.116033 0.092935 0.087202 0.092437 0.089906 0.094603 0.096312 0.121156 0.114346 0.128905 0.140924 0.157508 0.154363 0.159404 0.146619 0.159528 0.157422 0.158164
qa: -0.2934 -0.4656 -0.3299 0.1040 0.0445 -0.0948 -0.2664 -0.2770 -0.2772 0.3855 -0.0466 -0.2184 -0.2517 0.1058 0.0402 -0.2555 -0.2391 0.2591 -0.1385 -0.1904 0.2491 -0.1714 -0.2279 -0.1519 -0.1325 -0.1734 0.0920 0.0866 0.0870 0.0970 0.0977 0.0924 0.0981 0.0950 0.1160 0.0929 0.0872 0.0924 0.0899 0.0946 0.0963 0.1212 0.1143 0.1289 0.1409 0.1575 0.1544 0.1594 0.1466 0.1595 0.1574 0.1582
va: 2.1155 2.0404 2.0662 3.7035 3.7648 3.8389 3.9094 3.9038 3.8768 4.1679 3.7599 3.9220 3.9421 3.7889 3.6413 4.0677 3.9578 3.7535 3.9159 3.9024 3.7167 3.9130 4.0007 3.8956 3.8890 3.8940 1.0326 1.0382 1.0060 1.0021 1.0021 1.0196 0.9994 1.0003 1.0110 0.9964 1.0090 0.9962 1.0099 0.9973 0.9968 0.9906 1.0110 1.0199 1.0135 0.9911 0.9976 0.9956 1.0068 0.9902 0.9895 0.9902
dispcorr: -0.022674779 hartree
energy: -1117.893482002743
dipole: -34.69534 34.04902 -0.64632 -10.80981 10.60740 -0.20241 -3.67686 2.84084 -0.83602
magnitude: 1.07593 au
magnitude: 2.73480 debye
