program: Orca
programVersion: 5.0.2
elementType: O O O C C C C C C C C C C C C C C C C C C C C C C C H H H H H H H H H H H H H H H H H H H H H H H H H H
charge: 0
multiplicity: 1
keywords: wb97x-d3
keywords: def2-TZVPP
keywords: def2/J RIJCOSX
keywords: DEFGRID2
keywords: scfconv7
keywords: smallprint printgap noloewdin
keywords: NOSOSCF
formula: C23H26O3
InChI: InChI=1/C23H26O3/c1-16(2)13-20-21(23(20,3)4)22(24)25-15-17-9-8-12-19(14-17)26-18-10-6-5-7-11-18/h5-14,20-21H,15H2,1-4H3
52 atoms
O  0.199671 -2.785589 -0.395368
O  -0.682386 -1.364526 1.084398
O  3.923593 1.7240 0.766713
C  -3.274156 -3.065528 0.573407
C  -3.345358 -1.806445 -0.233005
C  -2.111333 -2.67434 -0.326079
C  -4.075099 -4.260952 0.120361
C  -3.152695 -2.962894 2.073065
C  -4.218944 -1.667108 -1.426707
C  -0.828726 -2.190921 0.216028
C  -5.460864 -1.176208 -1.408853
C  -6.259846 -1.030025 -2.667664
C  -6.155857 -0.735378 -0.157693
C  1.512293 -2.392918 -0.002626
C  1.867703 -1.001821 -0.449202
C  2.678515 -0.219043 0.36159
C  1.437788 -0.502344 -1.674351
C  3.070922 1.044782 -0.055701
C  1.825668 0.767426 -2.074352
C  2.645739 1.551418 -1.276581
C  3.812432 3.078496 0.919912
C  2.583102 3.711571 1.060296
C  4.993828 3.802534 0.994929
C  2.54881 5.08183 1.275107
C  4.943866 5.171016 1.217761
C  3.723697 5.817431 1.355257
H  -3.207093 -0.900097 0.350691
H  -2.017493 -3.270651 -1.227532
H  -4.095027 -4.367776 -0.963766
H  -5.10901 -4.178832 0.462711
H  -3.662458 -5.182179 0.536421
H  -2.695365 -2.033682 2.403887
H  -2.567961 -3.790151 2.479893
H  -4.14535 -3.015367 2.523824
H  -3.801043 -1.978851 -2.37991
H  -7.198967 -1.586305 -2.605388
H  -5.716559 -1.383148 -3.544336
H  -6.53238 0.014764 -2.840022
H  -5.558226 -0.878283 0.741369
H  -7.090654 -1.286092 -0.024708
H  -6.429434 0.3215 -0.214369
H  2.168565 -3.119472 -0.483151
H  1.641524 -2.49956 1.07639
H  3.011095 -0.589353 1.324569
H  0.802366 -1.094684 -2.320447
H  1.489322 1.155719 -3.026875
H  2.948669 2.536043 -1.609381
H  1.659815 3.148052 1.008719
H  5.944027 3.294711 0.886074
H  1.591602 5.575038 1.38494
H  5.867231 5.731996 1.283232
H  3.687495 6.885036 1.527128
elementType: O C H
totalener: -1117.86958591 hartree
nucrepener: 2162.38850410 hartree
electener: -3280.25809001 hartree
oneelecener: -5814.66395575 hartree
twoeener: 2534.40586574 hartree
cpcmener: -0.02546934 hartree
kineticenergy: 1112.81893503 hartree
xcener: -110.229290404127 hartree
chargesum: -0.0000000
charge: -0.295131 -0.465962 -0.329509 0.125096 -0.018342 -0.094939 -0.270952 -0.298124 -0.245829 0.389782 -0.041596 -0.229169 -0.248657 0.107337 0.041841 -0.258814 -0.240754 0.269155 -0.131005 -0.200451 0.277201 -0.186857 -0.244244 -0.147902 -0.124781 -0.183291 0.102585 0.089986 0.091423 0.096055 0.099688 0.095454 0.102250 0.094379 0.118745 0.092770 0.089222 0.094878 0.087008 0.095766 0.101199 0.120989 0.114317 0.129428 0.140191 0.157710 0.155553 0.156870 0.145448 0.159117 0.157039 0.157826
qa: -0.2951 -0.4660 -0.3295 0.1251 -0.0183 -0.0949 -0.2710 -0.2981 -0.2458 0.3898 -0.0416 -0.2292 -0.2487 0.1073 0.0418 -0.2588 -0.2408 0.2692 -0.1310 -0.2005 0.2772 -0.1869 -0.2442 -0.1479 -0.1248 -0.1833 0.1026 0.0900 0.0914 0.0961 0.0997 0.0955 0.1023 0.0944 0.1187 0.0928 0.0892 0.0949 0.0870 0.0958 0.1012 0.1210 0.1143 0.1294 0.1402 0.1577 0.1556 0.1569 0.1454 0.1591 0.1570 0.1578
va: 2.1164 2.0401 2.0707 3.6837 3.8026 3.8505 3.9062 3.8979 3.8556 4.1804 3.7076 3.9286 3.9383 3.7870 3.6344 4.0727 3.9620 3.7438 3.9067 3.9213 3.6975 3.9067 4.0042 3.8946 3.8877 3.9011 1.0229 1.0368 1.0027 1.0010 1.0030 1.0197 0.9995 1.0005 1.0071 0.9966 1.0076 0.9953 1.0084 0.9979 0.9989 0.9908 1.0108 1.0196 1.0140 0.9907 0.9965 0.9973 1.0082 0.9904 0.9894 0.9905
dispcorr: -0.023372970 hartree
energy: -1117.892958877463
dipole: -36.61144 35.81000 -0.80144 -11.80597 11.44663 -0.35934 -3.09562 2.29982 -0.79579
magnitude: 1.18521 au
magnitude: 3.01256 debye
